[riscv-reports] [#133071] sisyphus_riscv64 FAILED srpm=python3-module-netbox-sdk-0.0.9-alt1.src.rpm ...
Girar sisyphus_riscv64 awaiter iv
noreply at basealt.ru
Fri Jul 17 10:31:29 MSK 2026
http://web.build.srt.basealt.ru/tasks/133071/logs/events.1.1.log
subtask name riscv64
#100 python3-module-netbox-sdk failed
2026-Jul-17 07:25:07 :: task #133071 for sisyphus_riscv64 started by iv:
2026-Jul-17 07:25:07 :: message: sync
#100 build python3-module-netbox-sdk-0.0.9-alt1.src.rpm
#200 build netbox-floorplan-0.9.2-alt1.src.rpm
#300 build python3-module-slowapi-0.1.9-alt1.src.rpm
#400 build python3-module-django-6.0.6-alt1.src.rpm
#500 build python3-module-zensical-0.0.46-alt1.src.rpm
#600 build python3-module-drf-spectacular-sidecar-2026.6.1-alt1.src.rpm
#700 build netbox-proxbox-0.0.20.post1-alt1.src.rpm
#1000 build python3-module-oracledb-4.0.0-alt1.src.rpm
#1100 build python3-module-rq-2.10.0-alt1.src.rpm
#1200 build netbox-dns-1.5.10-alt1.src.rpm
#1300 build python3-module-pynetbox-7.8.0-alt1.src.rpm
#1400 build netbox-ip-monitor-0.1.5-alt1.src.rpm
#1500 build python3-module-grpcio-status-1.80.0-alt1.src.rpm
#1600 build python3-module-proxmox-sdk-0.0.9-alt2.src.rpm
#1700 build python3-module-strawberry-graphql-0.320.0-alt1.src.rpm
#2000 build netbox-4.6.4-alt1.src.rpm
#2100 build python3-module-diode-sdk-1.11.0-alt1.src.rpm
#2200 build proxbox-api-0.0.17.post1-alt1.src.rpm
#2300 build python3-module-strawberry-django-0.86.4-alt1.src.rpm
2026-Jul-17 07:25:07 :: created build repo
2026-Jul-17 07:25:12 :: [riscv64] #100 python3-module-netbox-sdk-0.0.9-alt1.src.rpm: build start
[riscv64] raise ModuleNotFoundError(
[riscv64] E ModuleNotFoundError: netbox_cli requires optional CLI dependencies. Install with: pip install 'netbox-sdk[cli]'
[riscv64] _______________ test_load_schema_falls_back_on_connection_error ________________
[riscv64] --
[riscv64] import click
[riscv64] E ModuleNotFoundError: No module named 'click'
[riscv64] The above exception was the direct cause of the following exception:
[riscv64] --
[riscv64] raise ModuleNotFoundError(
[riscv64] E ModuleNotFoundError: netbox_cli requires optional CLI dependencies. Install with: pip install 'netbox-sdk[cli]'
[riscv64] ____________ test_prompt_ssl_verify_if_unset_noop_when_already_set _____________
[riscv64] --
[riscv64] import click
[riscv64] E ModuleNotFoundError: No module named 'click'
[riscv64] The above exception was the direct cause of the following exception:
[riscv64] --
[riscv64] raise ModuleNotFoundError(
[riscv64] E ModuleNotFoundError: netbox_cli requires optional CLI dependencies. Install with: pip install 'netbox-sdk[cli]'
[riscv64] _______________ test_prompt_ssl_verify_if_unset_disable_persists _______________
[riscv64] --
[riscv64] import click
[riscv64] E ModuleNotFoundError: No module named 'click'
[riscv64] The above exception was the direct cause of the following exception:
[riscv64] --
[riscv64] raise ModuleNotFoundError(
[riscv64] E ModuleNotFoundError: netbox_cli requires optional CLI dependencies. Install with: pip install 'netbox-sdk[cli]'
[riscv64] __________________ test_prompt_ssl_verify_if_unset_keep_exits __________________
[riscv64] --
[riscv64] import click
[riscv64] E ModuleNotFoundError: No module named 'click'
[riscv64] The above exception was the direct cause of the following exception:
[riscv64] --
[riscv64] raise ModuleNotFoundError(
[riscv64] E ModuleNotFoundError: netbox_cli requires optional CLI dependencies. Install with: pip install 'netbox-sdk[cli]'
[riscv64] _____________ test_retry_probe_after_ssl_prompt_repokes_on_disable _____________
[riscv64] --
[riscv64] import click
[riscv64] E ModuleNotFoundError: No module named 'click'
[riscv64] The above exception was the direct cause of the following exception:
2026-Jul-17 07:31:28 :: [riscv64] python3-module-netbox-sdk-0.0.9-alt1.src.rpm: remote: build failed
2026-Jul-17 07:31:28 :: [riscv64] #100 python3-module-netbox-sdk-0.0.9-alt1.src.rpm: build FAILED
2026-Jul-17 07:31:28 :: [riscv64] requesting cancellation of task processing
2026-Jul-17 07:31:28 :: [riscv64] build FAILED
2026-Jul-17 07:31:29 :: task #133071 for sisyphus_riscv64 FAILED
More information about the Riscv-reports
mailing list