[riscv-reports] [#133071] [test-only] sisyphus_riscv64 FAILED (try 2) srpm=python3-module-netbox-sdk-0.0.9-alt1.src.rpm ...
Girar sisyphus_riscv64 awaiter iv
noreply at basealt.ru
Fri Jul 17 15:37:49 MSK 2026
http://web.build.srt.basealt.ru/tasks/133071/logs/events.2.1.log
subtask name riscv64
#100 python3-module-netbox-sdk failed
#200 netbox-floorplan 2:59
#300 python3-module-slowapi 3:56
#400 python3-module-django failed
#500 python3-module-zensical 17:12
#600 python3-module-drf-spectacular-sidecar 2:53
#700 netbox-proxbox 2:48
#1000 python3-module-oracledb 40:45
#1100 python3-module-rq 2:39
#1200 netbox-dns 2:33
#1300 python3-module-pynetbox 2:50
#1400 netbox-ip-monitor 2:25
#1500 python3-module-grpcio-status 2:32
#1600 python3-module-proxmox-sdk failed
#1700 python3-module-strawberry-graphql 7:57
#2000 netbox 4:55
#2100 python3-module-diode-sdk 2:46
#2200 proxbox-api failed
#2300 python3-module-strawberry-django 35:27
2026-Jul-17 09:10:11 :: test-only task #133071 for sisyphus_riscv64 resumed by iv:
2026-Jul-17 09:10:11 :: message: sync
#100 build python3-module-netbox-sdk-0.0.9-alt1.src.rpm
#200 build netbox-floorplan-0.9.2-alt1.src.rpm
#300 build python3-module-slowapi-0.1.9-alt1.src.rpm
#400 build python3-module-django-6.0.6-alt1.src.rpm
#500 build python3-module-zensical-0.0.46-alt1.src.rpm
#600 build python3-module-drf-spectacular-sidecar-2026.6.1-alt1.src.rpm
#700 build netbox-proxbox-0.0.20.post1-alt1.src.rpm
#1000 build python3-module-oracledb-4.0.0-alt1.src.rpm
#1100 build python3-module-rq-2.10.0-alt1.src.rpm
#1200 build netbox-dns-1.5.10-alt1.src.rpm
#1300 build python3-module-pynetbox-7.8.0-alt1.src.rpm
#1400 build netbox-ip-monitor-0.1.5-alt1.src.rpm
#1500 build python3-module-grpcio-status-1.80.0-alt1.src.rpm
#1600 build python3-module-proxmox-sdk-0.0.9-alt2.src.rpm
#1700 build python3-module-strawberry-graphql-0.320.0-alt1.src.rpm
#2000 build netbox-4.6.4-alt1.src.rpm
#2100 build python3-module-diode-sdk-1.11.0-alt1.src.rpm
#2200 build proxbox-api-0.0.17.post1-alt1.src.rpm
#2300 build python3-module-strawberry-django-0.86.4-alt1.src.rpm
2026-Jul-17 09:10:11 :: created build repo
2026-Jul-17 09:10:27 :: [riscv64] #100 python3-module-netbox-sdk-0.0.9-alt1.src.rpm: build start
[riscv64] raise ModuleNotFoundError(
[riscv64] E ModuleNotFoundError: netbox_cli requires optional CLI dependencies. Install with: pip install 'netbox-sdk[cli]'
[riscv64] _________________ test_load_schema_falls_back_when_no_base_url _________________
[riscv64] --
[riscv64] import click
[riscv64] E ModuleNotFoundError: No module named 'click'
[riscv64] The above exception was the direct cause of the following exception:
[riscv64] --
[riscv64] raise ModuleNotFoundError(
[riscv64] E ModuleNotFoundError: netbox_cli requires optional CLI dependencies. Install with: pip install 'netbox-sdk[cli]'
[riscv64] _______________ test_load_schema_falls_back_on_connection_error ________________
[riscv64] --
[riscv64] import click
[riscv64] E ModuleNotFoundError: No module named 'click'
[riscv64] The above exception was the direct cause of the following exception:
[riscv64] --
[riscv64] raise ModuleNotFoundError(
[riscv64] E ModuleNotFoundError: netbox_cli requires optional CLI dependencies. Install with: pip install 'netbox-sdk[cli]'
[riscv64] __________ test_get_index_uses_bundled_schema_without_connected_probe __________
[riscv64] --
[riscv64] import click
[riscv64] E ModuleNotFoundError: No module named 'click'
[riscv64] The above exception was the direct cause of the following exception:
[riscv64] --
[riscv64] raise ModuleNotFoundError(
[riscv64] E ModuleNotFoundError: netbox_cli requires optional CLI dependencies. Install with: pip install 'netbox-sdk[cli]'
[riscv64] _________ test_retry_probe_after_ssl_prompt_skips_when_not_cert_error __________
[riscv64] --
[riscv64] import click
[riscv64] E ModuleNotFoundError: No module named 'click'
[riscv64] The above exception was the direct cause of the following exception:
[riscv64] --
[riscv64] raise ModuleNotFoundError(
[riscv64] E ModuleNotFoundError: netbox_cli requires optional CLI dependencies. Install with: pip install 'netbox-sdk[cli]'
[riscv64] __________________ test_prompt_ssl_verify_if_unset_keep_exits __________________
[riscv64] --
[riscv64] import click
[riscv64] E ModuleNotFoundError: No module named 'click'
[riscv64] The above exception was the direct cause of the following exception:
2026-Jul-17 09:17:49 :: [riscv64] python3-module-netbox-sdk-0.0.9-alt1.src.rpm: remote: build failed
2026-Jul-17 09:17:49 :: [riscv64] #100 python3-module-netbox-sdk-0.0.9-alt1.src.rpm: build FAILED
2026-Jul-17 09:17:49 :: [riscv64] #100 python3-module-netbox-sdk-0.0.9-alt1.src.rpm:: KEEP_GOING cheat activated, moving on
2026-Jul-17 09:17:49 :: [riscv64] #200 netbox-floorplan-0.9.2-alt1.src.rpm: build start
2026-Jul-17 09:20:48 :: [riscv64] #200 netbox-floorplan-0.9.2-alt1.src.rpm: build OK
2026-Jul-17 09:20:48 :: [riscv64] #300 python3-module-slowapi-0.1.9-alt1.src.rpm: build start
2026-Jul-17 09:24:44 :: [riscv64] #300 python3-module-slowapi-0.1.9-alt1.src.rpm: build OK
2026-Jul-17 09:24:45 :: [riscv64] #400 python3-module-django-6.0.6-alt1.src.rpm: build start
[riscv64] A floating point mtime does not disturb was_modified_since (#18675). ... ok
[riscv64] ERROR: test_double_replaced_migrations_are_checked_correctly (migrations.test_commands.SquashMigrationsTests.test_double_replaced_migrations_are_checked_correctly)
[riscv64] If replaced migrations are already applied and replacing migrations
[riscv64] --
[riscv64] File "<frozen importlib._bootstrap>", line 1324, in _find_and_load_unlocked
[riscv64] ModuleNotFoundError: No module named 'tmpwucnpdit.migrations.0001_initial_squashed_0002_auto_20260717_0512_squashed_0003_auto_20260717_0512'
[riscv64] Ran 18710 tests in 3019.461s
[riscv64] FAILED (errors=1, skipped=1567, expected failures=5)
[riscv64] Destroying test database for alias 'default' ('file:memorydb_default?mode=memory&cache=shared')...
2026-Jul-17 10:22:28 :: [riscv64] python3-module-django-6.0.6-alt1.src.rpm: remote: build failed
2026-Jul-17 10:22:28 :: [riscv64] #400 python3-module-django-6.0.6-alt1.src.rpm: build FAILED
2026-Jul-17 10:22:28 :: [riscv64] #400 python3-module-django-6.0.6-alt1.src.rpm:: KEEP_GOING cheat activated, moving on
2026-Jul-17 10:22:28 :: [riscv64] #500 python3-module-zensical-0.0.46-alt1.src.rpm: build start
2026-Jul-17 10:39:40 :: [riscv64] #500 python3-module-zensical-0.0.46-alt1.src.rpm: build OK
2026-Jul-17 10:39:40 :: [riscv64] #600 python3-module-drf-spectacular-sidecar-2026.6.1-alt1.src.rpm: build start
2026-Jul-17 10:42:33 :: [riscv64] #600 python3-module-drf-spectacular-sidecar-2026.6.1-alt1.src.rpm: build OK
2026-Jul-17 10:42:33 :: [riscv64] #700 netbox-proxbox-0.0.20.post1-alt1.src.rpm: build start
2026-Jul-17 10:45:21 :: [riscv64] #700 netbox-proxbox-0.0.20.post1-alt1.src.rpm: build OK
2026-Jul-17 10:45:21 :: [riscv64] #1000 python3-module-oracledb-4.0.0-alt1.src.rpm: build start
2026-Jul-17 11:26:06 :: [riscv64] #1000 python3-module-oracledb-4.0.0-alt1.src.rpm: build OK
2026-Jul-17 11:26:06 :: [riscv64] #1100 python3-module-rq-2.10.0-alt1.src.rpm: build start
2026-Jul-17 11:28:45 :: [riscv64] #1100 python3-module-rq-2.10.0-alt1.src.rpm: build OK
2026-Jul-17 11:28:46 :: [riscv64] #1200 netbox-dns-1.5.10-alt1.src.rpm: build start
2026-Jul-17 11:31:19 :: [riscv64] #1200 netbox-dns-1.5.10-alt1.src.rpm: build OK
2026-Jul-17 11:31:19 :: [riscv64] #1300 python3-module-pynetbox-7.8.0-alt1.src.rpm: build start
2026-Jul-17 11:34:09 :: [riscv64] #1300 python3-module-pynetbox-7.8.0-alt1.src.rpm: build OK
2026-Jul-17 11:34:09 :: [riscv64] #1400 netbox-ip-monitor-0.1.5-alt1.src.rpm: build start
2026-Jul-17 11:36:34 :: [riscv64] #1400 netbox-ip-monitor-0.1.5-alt1.src.rpm: build OK
2026-Jul-17 11:36:35 :: [riscv64] #1500 python3-module-grpcio-status-1.80.0-alt1.src.rpm: build start
2026-Jul-17 11:39:07 :: [riscv64] #1500 python3-module-grpcio-status-1.80.0-alt1.src.rpm: build OK
2026-Jul-17 11:39:07 :: [riscv64] #1600 python3-module-proxmox-sdk-0.0.9-alt2.src.rpm: build start
[riscv64] > assert result.exit_code == 0, result.output
[riscv64] E AssertionError: Error: Backend error (https): Failed to initialize SDK: HTTPS backend requires either (user + password) or (user + token_name + token_value)
[riscv64] E
[riscv64] --
[riscv64] > assert result.exit_code == 0, result.output
[riscv64] E AssertionError: Error: Backend error (https): Failed to initialize SDK: HTTPS backend requires either (user + password) or (user + token_name + token_value)
[riscv64] E
[riscv64] --
[riscv64] > assert result.exit_code == 0, result.output
[riscv64] E AssertionError: Error: Backend error (https): Failed to initialize SDK: HTTPS backend requires either (user + password) or (user + token_name + token_value)
[riscv64] E
[riscv64] --
[riscv64] > assert ("docs", "--help") in argv_rows
[riscv64] E AssertionError: assert ('docs', '--help') in set()
[riscv64] tests/test_docgen_discovery.py:25: AssertionError
[riscv64] --
[riscv64] =========================== short test summary info ============================
[riscv64] FAILED tests/ceph/test_cli_commands.py::test_ceph_status_mock_json - Assertio...
[riscv64] FAILED tests/ceph/test_cli_commands.py::test_ceph_flags_mock - AssertionError...
[riscv64] FAILED tests/ceph/test_cli_commands.py::test_ceph_osds_mock - AssertionError:...
[riscv64] FAILED tests/ceph/test_cli_commands.py::test_ceph_rejects_non_pve - assert 4 ...
[riscv64] FAILED tests/cli/integration/test_backend_integration.py::TestErrorHandling::test_create_without_parameters
[riscv64] FAILED tests/test_docgen_discovery.py::test_discovery_returns_help_specs - as...
[riscv64] FAILED tests/test_docgen_discovery.py::test_root_help_present_once - assert 0...
2026-Jul-17 11:44:52 :: [riscv64] python3-module-proxmox-sdk-0.0.9-alt2.src.rpm: remote: build failed
2026-Jul-17 11:44:52 :: [riscv64] #1600 python3-module-proxmox-sdk-0.0.9-alt2.src.rpm: build FAILED
2026-Jul-17 11:44:52 :: [riscv64] #1600 python3-module-proxmox-sdk-0.0.9-alt2.src.rpm:: KEEP_GOING cheat activated, moving on
2026-Jul-17 11:44:53 :: [riscv64] #1700 python3-module-strawberry-graphql-0.320.0-alt1.src.rpm: build start
2026-Jul-17 11:52:50 :: [riscv64] #1700 python3-module-strawberry-graphql-0.320.0-alt1.src.rpm: build OK
2026-Jul-17 11:52:50 :: [riscv64] #2000 netbox-4.6.4-alt1.src.rpm: build start
2026-Jul-17 11:57:45 :: [riscv64] #2000 netbox-4.6.4-alt1.src.rpm: build OK
2026-Jul-17 11:57:45 :: [riscv64] #2100 python3-module-diode-sdk-1.11.0-alt1.src.rpm: build start
2026-Jul-17 12:00:31 :: [riscv64] #2100 python3-module-diode-sdk-1.11.0-alt1.src.rpm: build OK
2026-Jul-17 12:00:31 :: [riscv64] #2200 proxbox-api-0.0.17.post1-alt1.src.rpm: build start
[riscv64] <13>Jul 17 12:02:03 rpmi: rpm-macros-webserver-common-1.4-alt1 sisyphus_riscv64+11012.100.1.1 1635704496 installed
[riscv64] <13>Jul 17 12:02:03 rpmi: libgdbm6-1.26-alt1 sisyphus_riscv64+126243.100.1.1 1779345791 installed
[riscv64] <13>Jul 17 12:02:03 rpmi: libgdbm_compat4-1.26-alt1 sisyphus_riscv64+126243.100.1.1 1779345791 installed
[riscv64] <13>Jul 17 12:02:03 rpmi: libsqlite3-3.50.4-alt1 sisyphus_riscv64+91443.100.1.1 1754555936 installed
[riscv64] <13>Jul 17 12:02:03 rpmi: libmpdec3-2.5.1-alt3 sisyphus_riscv64+29035.100.1.1 1675621702 installed
[riscv64] <13>Jul 17 12:02:03 rpmi: libexpat-2.7.4-alt1 sisyphus_riscv64+109313.100.1.1 1770323898 installed
[riscv64] <13>Jul 17 12:02:03 rpmi: openssl-config-3.5.0-alt1 sisyphus_riscv64+99925.100.1.1 1762587030 installed
[riscv64] <13>Jul 17 12:02:03 rpmi: libb2-0.98.1-alt1_1 sisyphus_riscv64+13721.100.1.1 1638969645 installed
[riscv64] <13>Jul 17 12:02:03 rpmi: libp11-kit-1:0.26.2-alt3.g0eedd4d sisyphus_riscv64+132157.100.2.1 1783619252 installed
[riscv64] <13>Jul 17 12:02:03 rpmi: libtasn1-4.21.0-alt2 sisyphus_riscv64+128673.100.1.1 1781194651 installed
[riscv64] <13>Jul 17 12:02:03 rpmi: rpm-macros-alternatives-0.5.3-alt1 sisyphus_riscv64+71244.100.1.1 1738025117 installed
[riscv64] <13>Jul 17 12:02:03 rpmi: alternatives-0.5.3-alt1 sisyphus_riscv64+71244.100.1.1 1738025117 installed
[riscv64] <13>Jul 17 12:02:03 rpmi: ca-certificates-2026.04.22-alt1 sisyphus_riscv64+124784.100.1.1 1778294417 installed
[riscv64] <13>Jul 17 12:02:03 rpmi: ca-trust-0.2.0-alt1 sisyphus_riscv64+47419.100.1.1 1712764300 installed
[riscv64] <13>Jul 17 12:02:03 rpmi: p11-kit-trust-1:0.26.2-alt3.g0eedd4d sisyphus_riscv64+132157.100.2.1 1783619252 installed
[riscv64] <13>Jul 17 12:02:03 rpmi: libcrypto3-3.5.4-alt1 sisyphus_riscv64+99925.200.1.1 1762591620 installed
[riscv64] <13>Jul 17 12:02:03 rpmi: libssl3-3.5.4-alt1 sisyphus_riscv64+99925.200.1.1 1762591620 installed
[riscv64] <13>Jul 17 12:02:03 rpmi: python3-modules-sqlite3-3.13.14-alt1 sisyphus_riscv64+131047.100.1.1 1782959608 installed
[riscv64] <13>Jul 17 12:02:04 rpmi: python3-3.13.14-alt1 sisyphus_riscv64+131047.100.1.1 1782959608 installed
[riscv64] <13>Jul 17 12:02:05 rpmi: python3-base-3.13.14-alt1 sisyphus_riscv64+131047.100.1.1 1782959608 installed
[riscv64] <13>Jul 17 12:02:05 rpmi: python3-module-py3dephell-0.3.1-alt1 sisyphus_riscv64+67758.200.1.1 1734524951 installed
[riscv64] <13>Jul 17 12:02:05 rpmi: tests-for-installed-python3-pkgs-0.1.29-alt1 sisyphus_riscv64+100285.100.1.1 1762815565 installed
[riscv64] <13>Jul 17 12:02:05 rpmi: rpm-build-python3-0.1.29-alt1 sisyphus_riscv64+100285.100.1.1 1762815565 installed
[riscv64] <13>Jul 17 12:02:05 rpmi: rpm-build-webserver-common-1.4-alt1 sisyphus_riscv64+11012.100.1.1 1635704496 installed
[riscv64] <13>Jul 17 12:02:05 rpmi: rpm-macros-apache2-3.14-alt1 sisyphus_riscv64+33470.100.1.1 1685684342 installed
[riscv64] Reading Package Lists...
[riscv64] Building Dependency Tree...
[riscv64] MI2a: marked for install (shallow): python3-module-setuptools
[riscv64] MI2a: satisfying Depends: python3-module-jaraco-functools (NULL)
[riscv64] MI2a: maybe install (a providing target): python3-module-jaraco.functools 4.5.0-alt1:sisyphus_riscv64+125774.100.1.1 at 1778957231
[riscv64] MI2a: target SELECTED: python3-module-jaraco.functools 4.5.0-alt1:sisyphus_riscv64+125774.100.1.1 at 1778957231
[riscv64] MI2a: requesting to install python3-module-jaraco.functools (unspec'd ver; inspect with Debug::pkgMark-shallow)
[riscv64] MI2a: marked for install (shallow): python3-module-jaraco.functools
[riscv64] MI2a: satisfying Depends: python3(more_itertools) < 0
[riscv64] MI2a: maybe install (a providing target): python3-module-more-itertools 11.1.0-alt1:sisyphus_riscv64+127027.100.1.1 at 1779922586
[riscv64] MI2a: target SELECTED: python3-module-more-itertools 11.1.0-alt1:sisyphus_riscv64+127027.100.1.1 at 1779922586
[riscv64] MI2a: requesting to install python3-module-more-itertools (unspec'd ver; inspect with Debug::pkgMark-shallow)
[riscv64] MI2a: marked for install (shallow): python3-module-more-itertools
[riscv64] MI2a: satisfying Depends: python3-module-jaraco-text (NULL)
[riscv64] MI2a: maybe install (a providing target): python3-module-jaraco.text 4.2.0-alt1:sisyphus_riscv64+111212.100.1.1 at 1771626556
[riscv64] MI2a: target SELECTED: python3-module-jaraco.text 4.2.0-alt1:sisyphus_riscv64+111212.100.1.1 at 1771626556
[riscv64] MI2a: requesting to install python3-module-jaraco.text (unspec'd ver; inspect with Debug::pkgMark-shallow)
[riscv64] MI2a: marked for install (shallow): python3-module-jaraco.text
[riscv64] MI2a: satisfying Depends: python3-module-jaraco-context (NULL)
[riscv64] MI2a: maybe install (a providing target): python3-module-jaraco.context 6.1.2-alt1:sisyphus_riscv64+116191.100.1.1 at 1774458248
[riscv64] MI2a: target SELECTED: python3-module-jaraco.context 6.1.2-alt1:sisyphus_riscv64+116191.100.1.1 at 1774458248
[riscv64] MI2a: requesting to install python3-module-jaraco.context (unspec'd ver; inspect with Debug::pkgMark-shallow)
[riscv64] MI2a: marked for install (shallow): python3-module-jaraco.context
[riscv64] MI2a: satisfying Depends: python3-module-typer-slim (NULL)
[riscv64] MI2a: maybe install (a direct target): python3-module-typer-slim 0.26.8-alt1:sisyphus_riscv64+131429.300.1.1 at 1783262051
[riscv64] MI2a: target SELECTED: python3-module-typer-slim 0.26.8-alt1:sisyphus_riscv64+131429.300.1.1 at 1783262051
[riscv64] MI2a: requesting to install python3-module-typer-slim (unspec'd ver; inspect with Debug::pkgMark-shallow)
[riscv64] MI2a: marked for install (shallow): python3-module-typer-slim
[riscv64] MI2a: satisfying Depends: python3-module-typer = 0.26.8-alt1:sisyphus_riscv64+131429.300.1.1
[riscv64] MI2a: maybe install (a direct target): python3-module-typer 0.26.8-alt1:sisyphus_riscv64+131429.300.1.1 at 1783262051
[riscv64] MI2a: target SELECTED: python3-module-typer 0.26.8-alt1:sisyphus_riscv64+131429.300.1.1 at 1783262051
[riscv64] MI2a: requesting to install python3-module-typer (unspec'd ver; inspect with Debug::pkgMark-shallow)
[riscv64] MI2a: marked for install (shallow): python3-module-typer
[riscv64] MI2a: satisfying Depends: python3-module-annotated-doc (NULL)
[riscv64] MI2a: maybe install (a providing target): python3-module-annotated_doc 0.0.4-alt1:sisyphus_riscv64+102252.100.1.1 at 1764447695
[riscv64] MI2a: target SELECTED: python3-module-annotated_doc 0.0.4-alt1:sisyphus_riscv64+102252.100.1.1 at 1764447695
[riscv64] MI2a: requesting to install python3-module-annotated_doc (unspec'd ver; inspect with Debug::pkgMark-shallow)
[riscv64] MI2a: marked for install (shallow): python3-module-annotated_doc
[riscv64] MI2a: satisfying Depends: python3-module-rich (NULL)
[riscv64] MI2a: maybe install (a direct target): python3-module-rich 15.0.0-alt1:sisyphus_riscv64+119050.100.1.1 at 1776324666
[riscv64] MI2a: target SELECTED: python3-module-rich 15.0.0-alt1:sisyphus_riscv64+119050.100.1.1 at 1776324666
[riscv64] MI2a: requesting to install python3-module-rich (unspec'd ver; inspect with Debug::pkgMark-shallow)
[riscv64] MI2a: marked for install (shallow): python3-module-rich
[riscv64] MI2a: satisfying Depends: python3-module-markdown-it-py (NULL)
[riscv64] MI2a: maybe install (a providing target): python3-module-markdown-it 4.0.0-alt1:sisyphus_riscv64+94422.100.1.1 at 1757347017
[riscv64] MI2a: target SELECTED: python3-module-markdown-it 4.0.0-alt1:sisyphus_riscv64+94422.100.1.1 at 1757347017
[riscv64] MI2a: requesting to install python3-module-markdown-it (unspec'd ver; inspect with Debug::pkgMark-shallow)
[riscv64] MI2a: marked for install (shallow): python3-module-markdown-it
[riscv64] MI2a: satisfying Depends: python3-module-mdurl (NULL)
[riscv64] MI2a: maybe install (a direct target): python3-module-mdurl 0.1.2-alt1:sisyphus_riscv64+32107.1000.2.1 at 1683309157
[riscv64] MI2a: target SELECTED: python3-module-mdurl 0.1.2-alt1:sisyphus_riscv64+32107.1000.2.1 at 1683309157
[riscv64] MI2a: requesting to install python3-module-mdurl (unspec'd ver; inspect with Debug::pkgMark-shallow)
[riscv64] MI2a: marked for install (shallow): python3-module-mdurl
[riscv64] MI2a: satisfying Depends: python3(linkify_it) < 0
[riscv64] MI2a: maybe install (a providing target): python3-module-linkify-it-py 2.1.0-alt1.1:sisyphus_riscv64+116933.100.1.1 at 1774852211
[riscv64] MI2a: target SELECTED: python3-module-linkify-it-py 2.1.0-alt1.1:sisyphus_riscv64+116933.100.1.1 at 1774852211
[riscv64] MI2a: requesting to install python3-module-linkify-it-py (unspec'd ver; inspect with Debug::pkgMark-shallow)
[riscv64] MI2a: marked for install (shallow): python3-module-linkify-it-py
[riscv64] MI2a: satisfying Depends: python3(uc_micro.categories) < 0
[riscv64] MI2a: maybe install (a providing target): python3-module-uc-micro-py 2.0.0-alt1:sisyphus_riscv64+114686.100.1.1 at 1773520342
[riscv64] MI2a: target SELECTED: python3-module-uc-micro-py 2.0.0-alt1:sisyphus_riscv64+114686.100.1.1 at 1773520342
[riscv64] MI2a: requesting to install python3-module-uc-micro-py (unspec'd ver; inspect with Debug::pkgMark-shallow)
[riscv64] MI2a: marked for install (shallow): python3-module-uc-micro-py
[riscv64] MI2a: satisfying Depends: python3(typing_extensions) < 0
[riscv64] MI2a: maybe install (a providing target): python3-module-typing_extensions 4.15.0-alt2:sisyphus_riscv64+100533.100.1.1 at 1763069395
[riscv64] MI2a: target SELECTED: python3-module-typing_extensions 4.15.0-alt2:sisyphus_riscv64+100533.100.1.1 at 1763069395
[riscv64] MI2a: requesting to install python3-module-typing_extensions (unspec'd ver; inspect with Debug::pkgMark-shallow)
[riscv64] MI2a: marked for install (shallow): python3-module-typing_extensions
[riscv64] MI2a: satisfying Depends: python3-module-pygments (NULL)
[riscv64] MI2a: maybe install (a providing target): python3-module-Pygments 2.20.0-alt1:sisyphus_riscv64+117973.100.1.1 at 1775513420
[riscv64] MI2a: target SELECTED: python3-module-Pygments 2.20.0-alt1:sisyphus_riscv64+117973.100.1.1 at 1775513420
[riscv64] MI2a: requesting to install python3-module-Pygments (unspec'd ver; inspect with Debug::pkgMark-shallow)
[riscv64] MI2a: marked for install (shallow): python3-module-Pygments
[riscv64] MI2a: satisfying Depends: python3-module-shellingham (NULL)
[riscv64] MI2a: maybe install (a direct target): python3-module-shellingham 1.5.4-alt1:sisyphus_riscv64+39696.100.1.1 at 1698254854
[riscv64] MI2a: target SELECTED: python3-module-shellingham 1.5.4-alt1:sisyphus_riscv64+39696.100.1.1 at 1698254854
[riscv64] MI2a: requesting to install python3-module-shellingham (unspec'd ver; inspect with Debug::pkgMark-shallow)
[riscv64] MI2a: marked for install (shallow): python3-module-shellingham
[riscv64] MI2a: satisfying Depends: python3-module-packaging (NULL)
[riscv64] MI2a: maybe install (a direct target): python3-module-packaging 26.2-alt1:sisyphus_riscv64+121046.100.1.1 at 1778311400
[riscv64] MI2a: target SELECTED: python3-module-packaging 26.2-alt1:sisyphus_riscv64+121046.100.1.1 at 1778311400
[riscv64] MI2a: requesting to install python3-module-packaging (unspec'd ver; inspect with Debug::pkgMark-shallow)
[riscv64] MI2a: marked for install (shallow): python3-module-packaging
[riscv64] MI2a: satisfying Depends: python3-module-wheel (NULL)
[riscv64] MI2a: maybe install (a direct target): python3-module-wheel 0.47.0-alt1:sisyphus_riscv64+120561.100.1.1 at 1778210280
[riscv64] MI2a: target SELECTED: python3-module-wheel 0.47.0-alt1:sisyphus_riscv64+120561.100.1.1 at 1778210280
[riscv64] MI2a: requesting to install python3-module-wheel (unspec'd ver; inspect with Debug::pkgMark-shallow)
[riscv64] MI2a: marked for install (shallow): python3-module-wheel
[riscv64] MI2a: satisfying Depends: python3-dev (NULL)
[riscv64] MI2a: maybe install (a direct target): python3-dev 3.13.14-alt1:sisyphus_riscv64+131047.100.1.1 at 1782959608
[riscv64] MI2a: target SELECTED: python3-dev 3.13.14-alt1:sisyphus_riscv64+131047.100.1.1 at 1782959608
[riscv64] MI2a: requesting to install python3-dev (unspec'd ver; inspect with Debug::pkgMark-shallow)
[riscv64] MI2a: marked for install (shallow): python3-dev
[riscv64] MI2a: satisfying Depends: libpython3 = 3.13.14-alt1:sisyphus_riscv64+131047.100.1.1
[riscv64] MI2a: maybe install (a direct target): libpython3 3.13.14-alt1:sisyphus_riscv64+131047.100.1.1 at 1782959608
[riscv64] MI2a: target SELECTED: libpython3 3.13.14-alt1:sisyphus_riscv64+131047.100.1.1 at 1782959608
[riscv64] MI2a: requesting to install libpython3 (unspec'd ver; inspect with Debug::pkgMark-shallow)
[riscv64] MI2a: marked for install (shallow): libpython3
[riscv64] MI2a: satisfying Depends: python3-module-pkg-resources >= 1:80.10.2-alt2
[riscv64] MI2a: maybe install (a direct target): python3-module-pkg-resources 1:80.10.2-alt2.1:sisyphus_riscv64+116967.1000.1.2 at 1774892878
[riscv64] MI2a: target SELECTED: python3-module-pkg-resources 1:80.10.2-alt2.1:sisyphus_riscv64+116967.1000.1.2 at 1774892878
[riscv64] MI2a: requesting to install python3-module-pkg-resources (unspec'd ver; inspect with Debug::pkgMark-shallow)
[riscv64] MI2a: marked for install (shallow): python3-module-pkg-resources
[riscv64] MI2a: satisfying Depends: python3(platformdirs) < 0
[riscv64] MI2a: maybe install (a providing target): python3-module-platformdirs 4.10.0-alt1:sisyphus_riscv64+127269.100.1.1 at 1780172969
[riscv64] MI2a: target SELECTED: python3-module-platformdirs 4.10.0-alt1:sisyphus_riscv64+127269.100.1.1 at 1780172969
[riscv64] MI2a: requesting to install python3-module-platformdirs (unspec'd ver; inspect with Debug::pkgMark-shallow)
[riscv64] MI2a: marked for install (shallow): python3-module-platformdirs
[riscv64] MI2a: marked for install (shallow): python3-module-pytest
[riscv64] MI2a: satisfying Depends: python3-module-iniconfig (NULL)
[riscv64] MI2a: maybe install (a direct target): python3-module-iniconfig 2.3.0-alt1:sisyphus_riscv64+98229.100.1.1 at 1761491259
[riscv64] MI2a: target SELECTED: python3-module-iniconfig 2.3.0-alt1:sisyphus_riscv64+98229.100.1.1 at 1761491259
[riscv64] MI2a: requesting to install python3-module-iniconfig (unspec'd ver; inspect with Debug::pkgMark-shallow)
[riscv64] MI2a: marked for install (shallow): python3-module-iniconfig
[riscv64] MI2a: satisfying Depends: python3-module-pluggy (NULL)
[riscv64] MI2a: maybe install (a direct target): python3-module-pluggy 1.6.0-alt1.1:sisyphus_riscv64+116951.300.1.1 at 1774868949
[riscv64] MI2a: target SELECTED: python3-module-pluggy 1.6.0-alt1.1:sisyphus_riscv64+116951.300.1.1 at 1774868949
[riscv64] MI2a: requesting to install python3-module-pluggy (unspec'd ver; inspect with Debug::pkgMark-shallow)
[riscv64] MI2a: marked for install (shallow): python3-module-pluggy
[riscv64] MI2a: marked for install (shallow): python3-module-pytest-xdist
[riscv64] MI2a: satisfying Depends: python3-module-execnet (NULL)
[riscv64] MI2a: maybe install (a direct target): python3-module-execnet 2.1.2-alt1:sisyphus_riscv64+100654.100.1.1 at 1763113507
[riscv64] MI2a: target SELECTED: python3-module-execnet 2.1.2-alt1:sisyphus_riscv64+100654.100.1.1 at 1763113507
[riscv64] MI2a: requesting to install python3-module-execnet (unspec'd ver; inspect with Debug::pkgMark-shallow)
[riscv64] MI2a: marked for install (shallow): python3-module-execnet
[riscv64] MI2a: satisfying Depends: python3(servicemanager) < 0
[riscv64] MI2a: maybe install (a providing target): python3-module-servicemanager 2.0.7-alt1:sisyphus_riscv64+10965.100.1.1 at 1635696057
[riscv64] MI2a: target SELECTED: python3-module-servicemanager 2.0.7-alt1:sisyphus_riscv64+10965.100.1.1 at 1635696057
[riscv64] MI2a: requesting to install python3-module-servicemanager (unspec'd ver; inspect with Debug::pkgMark-shallow)
[riscv64] MI2a: marked for install (shallow): python3-module-servicemanager
[riscv64] MI2a: satisfying Depends: python3(argcomplete) < 0
[riscv64] MI2a: maybe install (a providing target): python3-module-argcomplete 3.7.0-alt1:sisyphus_riscv64+131587.100.1.1 at 1783335655
[riscv64] MI2a: target SELECTED: python3-module-argcomplete 3.7.0-alt1:sisyphus_riscv64+131587.100.1.1 at 1783335655
[riscv64] MI2a: requesting to install python3-module-argcomplete (unspec'd ver; inspect with Debug::pkgMark-shallow)
[riscv64] MI2a: marked for install (shallow): python3-module-argcomplete
[riscv64] MI2a: satisfying Depends: python3(bottle) < 0
[riscv64] MI2a: maybe install (a providing target): python3-module-bottle 1:0.13.4-alt1:sisyphus_riscv64+113819.100.1.1 at 1773119860
[riscv64] MI2a: target SELECTED: python3-module-bottle 1:0.13.4-alt1:sisyphus_riscv64+113819.100.1.1 at 1773119860
[riscv64] MI2a: requesting to install python3-module-bottle (unspec'd ver; inspect with Debug::pkgMark-shallow)
[riscv64] MI2a: marked for install (shallow): python3-module-bottle
[riscv64] MI2a: satisfying Depends: python3(prettytable) < 0
[riscv64] MI2a: maybe install (a providing target): python3-module-prettytable 2.1.0-alt1:sisyphus_riscv64+8653.100.1.1 at 1633649374
[riscv64] MI2a: target SELECTED: python3-module-prettytable 2.1.0-alt1:sisyphus_riscv64+8653.100.1.1 at 1633649374
[riscv64] MI2a: requesting to install python3-module-prettytable (unspec'd ver; inspect with Debug::pkgMark-shallow)
[riscv64] MI2a: marked for install (shallow): python3-module-prettytable
[riscv64] MI2a: satisfying Depends: python3(wcwidth) < 0
[riscv64] MI2a: maybe install (a providing target): python3-module-wcwidth 0.8.2-alt1:sisyphus_riscv64+130963.100.1.1 at 1782905123
[riscv64] MI2a: target SELECTED: python3-module-wcwidth 0.8.2-alt1:sisyphus_riscv64+130963.100.1.1 at 1782905123
[riscv64] MI2a: requesting to install python3-module-wcwidth (unspec'd ver; inspect with Debug::pkgMark-shallow)
[riscv64] MI2a: marked for install (shallow): python3-module-wcwidth
[riscv64] MI2a: satisfying Depends: python3(pymongo) < 0
[riscv64] MI2a: maybe install (a providing target): python3-module-pymongo 4.16.0-alt1:sisyphus_riscv64+108395.100.1.1 at 1769524281
[riscv64] MI2a: target SELECTED: python3-module-pymongo 4.16.0-alt1:sisyphus_riscv64+108395.100.1.1 at 1769524281
[riscv64] MI2a: requesting to install python3-module-pymongo (unspec'd ver; inspect with Debug::pkgMark-shallow)
[riscv64] MI2a: marked for install (shallow): python3-module-pymongo
[riscv64] MI2a: satisfying Depends: python3(OpenSSL) < 0
[riscv64] MI2a: maybe install (a providing target): python3-module-openssl 26.3.0-alt1:sisyphus_riscv64+130301.200.1.1 at 1782529288
[riscv64] MI2a: target SELECTED: python3-module-openssl 26.3.0-alt1:sisyphus_riscv64+130301.200.1.1 at 1782529288
[riscv64] MI2a: requesting to install python3-module-openssl (unspec'd ver; inspect with Debug::pkgMark-shallow)
[riscv64] MI2a: marked for install (shallow): python3-module-openssl
[riscv64] MI2a: satisfying Depends: python3-module-cryptography < 50
[riscv64] MI2a: maybe install (a direct target): python3-module-cryptography 49.0.0-alt1:sisyphus_riscv64+130301.100.1.1 at 1782529132
[riscv64] MI2a: target SELECTED: python3-module-cryptography 49.0.0-alt1:sisyphus_riscv64+130301.100.1.1 at 1782529132
[riscv64] MI2a: requesting to install python3-module-cryptography (unspec'd ver; inspect with Debug::pkgMark-shallow)
[riscv64] MI2a: marked for install (shallow): python3-module-cryptography
[riscv64] MI2a: satisfying Depends: python3(cffi) < 0
[riscv64] MI2a: maybe install (a providing target): python3-module-cffi 2.1.0-alt1:sisyphus_riscv64+132063.100.1.1 at 1783543468
[riscv64] MI2a: target SELECTED: python3-module-cffi 2.1.0-alt1:sisyphus_riscv64+132063.100.1.1 at 1783543468
[riscv64] MI2a: requesting to install python3-module-cffi (unspec'd ver; inspect with Debug::pkgMark-shallow)
[riscv64] MI2a: marked for install (shallow): python3-module-cffi
[riscv64] MI2a: satisfying Depends: python3-module-pycparser (NULL)
[riscv64] MI2a: maybe install (a direct target): python3-module-pycparser 2.23-alt1:sisyphus_riscv64+113531.100.1.1 at 1773048157
[riscv64] MI2a: target SELECTED: python3-module-pycparser 2.23-alt1:sisyphus_riscv64+113531.100.1.1 at 1773048157
[riscv64] MI2a: requesting to install python3-module-pycparser (unspec'd ver; inspect with Debug::pkgMark-shallow)
[riscv64] MI2a: marked for install (shallow): python3-module-pycparser
[riscv64] MI2a: satisfying Depends: python3(requests) < 0
[riscv64] MI2a: maybe install (a providing target): python3-module-requests 2.34.2-alt1:sisyphus_riscv64+125864.100.1.1 at 1779099226
[riscv64] MI2a: target SELECTED: python3-module-requests 2.34.2-alt1:sisyphus_riscv64+125864.100.1.1 at 1779099226
[riscv64] MI2a: requesting to install python3-module-requests (unspec'd ver; inspect with Debug::pkgMark-shallow)
[riscv64] MI2a: marked for install (shallow): python3-module-requests
[riscv64] MI2a: satisfying Depends: python3-module-charset-normalizer (NULL)
[riscv64] MI2a: maybe install (a direct target): python3-module-charset-normalizer 3.4.9-alt1:sisyphus_riscv64+132131.100.1.1 at 1783594498
[riscv64] MI2a: target SELECTED: python3-module-charset-normalizer 3.4.9-alt1:sisyphus_riscv64+132131.100.1.1 at 1783594498
[riscv64] MI2a: requesting to install python3-module-charset-normalizer (unspec'd ver; inspect with Debug::pkgMark-shallow)
[riscv64] MI2a: marked for install (shallow): python3-module-charset-normalizer
[riscv64] MI2a: satisfying Depends: python3-module-idna (NULL)
[riscv64] MI2a: maybe install (a direct target): python3-module-idna 3.18-alt1:sisyphus_riscv64+128726.100.1.1 at 1781268999
[riscv64] MI2a: target SELECTED: python3-module-idna 3.18-alt1:sisyphus_riscv64+128726.100.1.1 at 1781268999
[riscv64] MI2a: requesting to install python3-module-idna (unspec'd ver; inspect with Debug::pkgMark-shallow)
[riscv64] MI2a: marked for install (shallow): python3-module-idna
[riscv64] MI2a: satisfying Depends: python3-module-urllib3 (NULL)
[riscv64] MI2a: maybe install (a direct target): python3-module-urllib3 2:2.7.0-alt1:sisyphus_riscv64+125347.100.1.1 at 1778792208
[riscv64] MI2a: target SELECTED: python3-module-urllib3 2:2.7.0-alt1:sisyphus_riscv64+125347.100.1.1 at 1778792208
[riscv64] MI2a: requesting to install python3-module-urllib3 (unspec'd ver; inspect with Debug::pkgMark-shallow)
[riscv64] MI2a: marked for install (shallow): python3-module-urllib3
[riscv64] MI2a: satisfying Depends: python3(service_identity) < 0
[riscv64] MI2a: maybe install (a providing target): python3-module-service_identity 26.1.0-alt1:sisyphus_riscv64+129287.100.1.1 at 1781687893
[riscv64] MI2a: target SELECTED: python3-module-service_identity 26.1.0-alt1:sisyphus_riscv64+129287.100.1.1 at 1781687893
[riscv64] MI2a: requesting to install python3-module-service_identity (unspec'd ver; inspect with Debug::pkgMark-shallow)
[riscv64] MI2a: marked for install (shallow): python3-module-service_identity
[riscv64] MI2a: satisfying Depends: python3(attr) < 0
[riscv64] MI2a: maybe install (a providing target): python3-module-attrs 26.1.0-alt1:sisyphus_riscv64+118129.100.1.1 at 1775598784
[riscv64] MI2a: target SELECTED: python3-module-attrs 26.1.0-alt1:sisyphus_riscv64+118129.100.1.1 at 1775598784
[riscv64] MI2a: requesting to install python3-module-attrs (unspec'd ver; inspect with Debug::pkgMark-shallow)
[riscv64] MI2a: marked for install (shallow): python3-module-attrs
[riscv64] MI2a: satisfying Depends: python3-module-bson = 4.16.0-alt1:sisyphus_riscv64+108395.100.1.1
[riscv64] MI2a: maybe install (a direct target): python3-module-bson 4.16.0-alt1:sisyphus_riscv64+108395.100.1.1 at 1769524281
[riscv64] MI2a: target SELECTED: python3-module-bson 4.16.0-alt1:sisyphus_riscv64+108395.100.1.1 at 1769524281
[riscv64] MI2a: requesting to install python3-module-bson (unspec'd ver; inspect with Debug::pkgMark-shallow)
[riscv64] MI2a: marked for install (shallow): python3-module-bson
[riscv64] MI2a: marked for install (shallow): python3-module-httpx
[riscv64] MI2a: satisfying Depends: python3-module-anyio (NULL)
[riscv64] MI2a: maybe install (a direct target): python3-module-anyio 4.13.0-alt0.port:sisyphus_riscv64+116395.100.1.1 at 1774506503
[riscv64] MI2a: target SELECTED: python3-module-anyio 4.13.0-alt0.port:sisyphus_riscv64+116395.100.1.1 at 1774506503
[riscv64] MI2a: requesting to install python3-module-anyio (unspec'd ver; inspect with Debug::pkgMark-shallow)
[riscv64] MI2a: marked for install (shallow): python3-module-anyio
[riscv64] MI2a: satisfying Depends: python3(outcome) < 0
[riscv64] MI2a: maybe install (a providing target): python3-module-outcome 1.3.0-alt1.1:sisyphus_riscv64+116957.1100.1.1 at 1774881354
[riscv64] MI2a: target SELECTED: python3-module-outcome 1.3.0-alt1.1:sisyphus_riscv64+116957.1100.1.1 at 1774881354
[riscv64] MI2a: requesting to install python3-module-outcome (unspec'd ver; inspect with Debug::pkgMark-shallow)
[riscv64] MI2a: marked for install (shallow): python3-module-outcome
[riscv64] MI2a: satisfying Depends: python3-module-certifi (NULL)
[riscv64] MI2a: maybe install (a direct target): python3-module-certifi 2025.10.5-alt1.1:sisyphus_riscv64+116964.200.1.1 at 1774883570
[riscv64] MI2a: target SELECTED: python3-module-certifi 2025.10.5-alt1.1:sisyphus_riscv64+116964.200.1.1 at 1774883570
[riscv64] MI2a: requesting to install python3-module-certifi (unspec'd ver; inspect with Debug::pkgMark-shallow)
[riscv64] MI2a: marked for install (shallow): python3-module-certifi
[riscv64] MI2a: satisfying Depends: python3-module-httpcore (NULL)
[riscv64] MI2a: maybe install (a direct target): python3-module-httpcore 1.0.9-alt1:sisyphus_riscv64+113822.100.1.1 at 1773121419
[riscv64] MI2a: target SELECTED: python3-module-httpcore 1.0.9-alt1:sisyphus_riscv64+113822.100.1.1 at 1773121419
[riscv64] MI2a: requesting to install python3-module-httpcore (unspec'd ver; inspect with Debug::pkgMark-shallow)
[riscv64] MI2a: marked for install (shallow): python3-module-httpcore
[riscv64] MI2a: satisfying Depends: python3(h11) < 0
[riscv64] MI2a: maybe install (a providing target): python3-module-h11 0.16.0-alt1:sisyphus_riscv64+88479.100.1.1 at 1751614665
[riscv64] MI2a: target SELECTED: python3-module-h11 0.16.0-alt1:sisyphus_riscv64+88479.100.1.1 at 1751614665
[riscv64] MI2a: requesting to install python3-module-h11 (unspec'd ver; inspect with Debug::pkgMark-shallow)
[riscv64] MI2a: marked for install (shallow): python3-module-h11
[riscv64] MI2a: satisfying Depends: python3(socksio) < 0
[riscv64] MI2a: maybe install (a providing target): python3-module-socksio 1.0.0-alt2:sisyphus_riscv64+103395.100.1.1 at 1765328069
[riscv64] MI2a: target SELECTED: python3-module-socksio 1.0.0-alt2:sisyphus_riscv64+103395.100.1.1 at 1765328069
[riscv64] MI2a: requesting to install python3-module-socksio (unspec'd ver; inspect with Debug::pkgMark-shallow)
[riscv64] MI2a: marked for install (shallow): python3-module-socksio
[riscv64] MI2a: marked for install (shallow): python3-module-sqlmodel
[riscv64] MI2a: satisfying Depends: python3-module-pydantic (NULL)
[riscv64] MI2a: maybe install (a direct target): python3-module-pydantic 2.13.4-alt1:sisyphus_riscv64+124778.300.2.1 at 1778653147
[riscv64] MI2a: target SELECTED: python3-module-pydantic 2.13.4-alt1:sisyphus_riscv64+124778.300.2.1 at 1778653147
[riscv64] MI2a: requesting to install python3-module-pydantic (unspec'd ver; inspect with Debug::pkgMark-shallow)
[riscv64] MI2a: marked for install (shallow): python3-module-pydantic
[riscv64] MI2a: satisfying Depends: python3-module-annotated-types (NULL)
[riscv64] MI2a: maybe install (a direct target): python3-module-annotated-types 0.7.0-alt1:sisyphus_riscv64+49627.100.1.1 at 1717063650
[riscv64] MI2a: target SELECTED: python3-module-annotated-types 0.7.0-alt1:sisyphus_riscv64+49627.100.1.1 at 1717063650
[riscv64] MI2a: requesting to install python3-module-annotated-types (unspec'd ver; inspect with Debug::pkgMark-shallow)
[riscv64] MI2a: marked for install (shallow): python3-module-annotated-types
[riscv64] MI2a: satisfying Depends: python3-module-pydantic-core (NULL)
[riscv64] MI2a: maybe install (a direct target): python3-module-pydantic-core 2.46.4-alt1:sisyphus_riscv64+124778.200.2.1 at 1778652816
[riscv64] MI2a: target SELECTED: python3-module-pydantic-core 2.46.4-alt1:sisyphus_riscv64+124778.200.2.1 at 1778652816
[riscv64] MI2a: requesting to install python3-module-pydantic-core (unspec'd ver; inspect with Debug::pkgMark-shallow)
[riscv64] MI2a: marked for install (shallow): python3-module-pydantic-core
[riscv64] MI2a: satisfying Depends: python3-module-typing-inspection (NULL)
[riscv64] MI2a: maybe install (a direct target): python3-module-typing-inspection 0.4.2-alt1:sisyphus_riscv64+97149.200.3.1 at 1761216364
[riscv64] MI2a: target SELECTED: python3-module-typing-inspection 0.4.2-alt1:sisyphus_riscv64+97149.200.3.1 at 1761216364
[riscv64] MI2a: requesting to install python3-module-typing-inspection (unspec'd ver; inspect with Debug::pkgMark-shallow)
[riscv64] MI2a: marked for install (shallow): python3-module-typing-inspection
[riscv64] MI2a: marked for install (shallow): python3-module-fastapi
[riscv64] MI2a: satisfying Depends: python3-module-starlette (NULL)
[riscv64] MI2a: maybe install (a direct target): python3-module-starlette 1.2.1-alt1:sisyphus_riscv64+128514.200.1.1 at 1781148313
[riscv64] MI2a: target SELECTED: python3-module-starlette 1.2.1-alt1:sisyphus_riscv64+128514.200.1.1 at 1781148313
[riscv64] MI2a: requesting to install python3-module-starlette (unspec'd ver; inspect with Debug::pkgMark-shallow)
[riscv64] MI2a: marked for install (shallow): python3-module-starlette
[riscv64] MI2a: satisfying Depends: python3(itsdangerous) < 0
[riscv64] MI2a: maybe install (a providing target): python3-module-itsdangerous 2.2.0-alt1:sisyphus_riscv64+47960.100.1.1 at 1714060325
[riscv64] MI2a: target SELECTED: python3-module-itsdangerous 2.2.0-alt1:sisyphus_riscv64+47960.100.1.1 at 1714060325
[riscv64] MI2a: requesting to install python3-module-itsdangerous (unspec'd ver; inspect with Debug::pkgMark-shallow)
[riscv64] MI2a: marked for install (shallow): python3-module-itsdangerous
[riscv64] MI2a: marked for install (shallow): python3-module-jinja2
[riscv64] MI2a: satisfying Depends: python3-module-markupsafe (NULL)
[riscv64] MI2a: maybe install (a direct target): python3-module-markupsafe 1:3.0.3-alt1:sisyphus_riscv64+97041.100.1.1 at 1761039734
[riscv64] MI2a: target SELECTED: python3-module-markupsafe 1:3.0.3-alt1:sisyphus_riscv64+97041.100.1.1 at 1761039734
[riscv64] MI2a: requesting to install python3-module-markupsafe (unspec'd ver; inspect with Debug::pkgMark-shallow)
[riscv64] MI2a: marked for install (shallow): python3-module-markupsafe
[riscv64] MI2a: marked for install (shallow): python3-module-greenlet
[riscv64] MI2a: satisfying Depends: python3(objgraph) < 0
[riscv64] MI2a: maybe install (a providing target): python3-module-objgraph 3.6.2-alt1:sisyphus_riscv64+54409.100.1.1 at 1728602571
[riscv64] MI2a: target SELECTED: python3-module-objgraph 3.6.2-alt1:sisyphus_riscv64+54409.100.1.1 at 1728602571
[riscv64] MI2a: requesting to install python3-module-objgraph (unspec'd ver; inspect with Debug::pkgMark-shallow)
[riscv64] MI2a: marked for install (shallow): python3-module-objgraph
[riscv64] MI2a: satisfying Depends: python3(psutil) < 0
[riscv64] MI2a: maybe install (a providing target): python3-module-psutil 7.1.3-alt1:sisyphus_riscv64+113583.100.1.1 at 1773054901
[riscv64] MI2a: target SELECTED: python3-module-psutil 7.1.3-alt1:sisyphus_riscv64+113583.100.1.1 at 1773054901
[riscv64] MI2a: requesting to install python3-module-psutil (unspec'd ver; inspect with Debug::pkgMark-shallow)
[riscv64] MI2a: marked for install (shallow): python3-module-psutil
[riscv64] rpm-build-python3 is already the newest version.
[riscv64] rpm-macros-systemd is already the newest version.
[riscv64] rpm-macros-apache2 is already the newest version.
[riscv64] rpm-build-webserver-common is already the newest version.
[riscv64] E: Couldn't find package python3-module-netbox-sdk
[riscv64] hsh-install: Failed to calculate package file list.
[riscv64] hsh-install: Failed to generate package file list.
2026-Jul-17 12:02:11 :: [riscv64] proxbox-api-0.0.17.post1-alt1.src.rpm: remote: cannot build src.rpm
2026-Jul-17 12:02:11 :: [riscv64] #2200 proxbox-api-0.0.17.post1-alt1.src.rpm: build FAILED
2026-Jul-17 12:02:11 :: [riscv64] #2200 proxbox-api-0.0.17.post1-alt1.src.rpm:: KEEP_GOING cheat activated, moving on
2026-Jul-17 12:02:11 :: [riscv64] #2300 python3-module-strawberry-django-0.86.4-alt1.src.rpm: build start
2026-Jul-17 12:37:38 :: [riscv64] #2300 python3-module-strawberry-django-0.86.4-alt1.src.rpm: build OK
find: 'riscv64/srpm/': No such file or directory
2026-Jul-17 12:37:39 :: 200: build check OK
2026-Jul-17 12:37:40 :: 300: build check OK
find: 'riscv64/srpm/': No such file or directory
2026-Jul-17 12:37:42 :: 500: build check OK
2026-Jul-17 12:37:42 :: 600: build check OK
2026-Jul-17 12:37:43 :: 700: build check OK
2026-Jul-17 12:37:44 :: 1000: build check OK
2026-Jul-17 12:37:44 :: 1100: build check OK
2026-Jul-17 12:37:45 :: 1200: build check OK
2026-Jul-17 12:37:45 :: 1300: build check OK
2026-Jul-17 12:37:45 :: 1400: build check OK
2026-Jul-17 12:37:46 :: 1500: build check OK
find: 'riscv64/srpm/': No such file or directory
2026-Jul-17 12:37:46 :: 1700: build check OK
2026-Jul-17 12:37:47 :: 2000: build check OK
2026-Jul-17 12:37:48 :: 2100: build check OK
find: 'riscv64/srpm/': No such file or directory
2026-Jul-17 12:37:48 :: 2300: build check OK
2026-Jul-17 12:37:49 :: build check FAILED for: #100 #400 #1600 #2200
2026-Jul-17 12:37:49 :: task #133071 for sisyphus_riscv64 FAILED
More information about the Riscv-reports
mailing list