[riscv-reports] [#130131] sisyphus_riscv64 FAILED (try 3) srpm=uhd-4.10.0.0-alt1.src.rpm srpm=soapyuhd-0.4.1-alt2.src.rpm ...
Girar sisyphus_riscv64 awaiter recycler
noreply at basealt.ru
Fri Jul 17 10:15:22 MSK 2026
http://web.build.srt.basealt.ru/tasks/130131/logs/events.3.1.log
2026-Jul-17 07:13:32 :: shared task #130131 for sisyphus_riscv64 resumed by recycler:
2026-Jul-17 07:13:32 :: message: sync
#100 build uhd-4.10.0.0-alt1.src.rpm
#200 removed
#300 removed
#400 build soapyuhd-0.4.1-alt2.src.rpm
#500 build satdump-1.2.2-alt1.git20250923.b79af48.src.rpm
#600 removed
2026-Jul-17 07:13:32 :: created build repo
2026-Jul-17 07:13:43 :: [riscv64] #100 uhd-4.10.0.0-alt1.src.rpm: build start
2026-Jul-17 07:14:06 :: [riscv64] #100 uhd-4.10.0.0-alt1.src.rpm: build swiftly SKIPPED
2026-Jul-17 07:14:06 :: [riscv64] #400 soapyuhd-0.4.1-alt2.src.rpm: build start
2026-Jul-17 07:14:08 :: [riscv64] #400 soapyuhd-0.4.1-alt2.src.rpm: build swiftly SKIPPED
2026-Jul-17 07:14:08 :: [riscv64] #500 satdump-1.2.2-alt1.git20250923.b79af48.src.rpm: build start
2026-Jul-17 07:14:14 :: [riscv64] #500 satdump-1.2.2-alt1.git20250923.b79af48.src.rpm: build swiftly SKIPPED
2026-Jul-17 07:14:14 :: 100: build check OK (cached)
2026-Jul-17 07:14:14 :: 400: build check OK (cached)
2026-Jul-17 07:14:14 :: 500: build check OK (cached)
2026-Jul-17 07:14:14 :: build check OK
2026-Jul-17 07:14:15 :: #100: uhd-4.10.0.0-alt1.src.rpm: version check OK
2026-Jul-17 07:14:15 :: #400: soapyuhd-0.4.1-alt2.src.rpm: version check OK
2026-Jul-17 07:14:15 :: #500: satdump-1.2.2-alt1.git20250923.b79af48.src.rpm: package `satdump' version `1.2.2-alt1.git20250923.b79af48' was built earlier for sisyphus_riscv64 from a different source: `srpm:f09bb48f67b9594866e564184a5e05a11d426ff7'
2026-Jul-17 07:14:15 :: source id check COND-OK
2026-Jul-17 07:14:15 :: #500: satdump-1.2.2-alt1.git20250923.b79af48.src.rpm: version check OK
2026-Jul-17 07:14:15 :: build version check OK
2026-Jul-17 07:14:16 :: noarch check OK
2026-Jul-17 07:14:16 :: plan: src +3 -2 =21303, noarch +3 -2 =22134, riscv64 +13 -11 =37649
#400 soapyuhd 0.4.1-alt1 -> 0.4.1-alt2
Mon Jun 15 2026 Nikolay Strelkov <snk at altlinux.org> 0.4.1-alt2
- Fix build with uhd-4.10.
#100 uhd 4.9.0.1-alt1 -> 4.10.0.0-alt1
Tue Jun 23 2026 Anton Midyukov <antohami at altlinux.org> 4.10.0.0-alt1
- New version 4.10.0.0.
2026-Jul-17 07:14:44 :: patched apt indices
2026-Jul-17 07:14:47 :: created next repo
2026-Jul-17 07:14:57 :: duplicate provides check OK
riscv64: NEW unmet dependencies detected:
satdump#1.2.2-alt1.git20250923.b79af48:sisyphus_riscv64+130131.500.2.1 at 1782547025 libhdf5.so.310()(64bit) >= set:pki6UKREEqcPlaxc0YN6p5siee5enVcav8bHLsrEKhoE9FNFxrrdNvgpLRZrs8wE7Z5wYV0T6MfPHZkTjuSRhiYUv0TtapGL20X0
satdump#1.2.2-alt1.git20250923.b79af48:sisyphus_riscv64+130131.500.2.1 at 1782547025 libhdf5_hl.so.310()(64bit) >= set:lk6vl0
satdump-debuginfo#1.2.2-alt1.git20250923.b79af48:sisyphus_riscv64+130131.500.2.1 at 1782547025 debug64(libhdf5.so.310)
satdump-debuginfo#1.2.2-alt1.git20250923.b79af48:sisyphus_riscv64+130131.500.2.1 at 1782547025 debug64(libhdf5_hl.so.310)
ACLs of affected packages (1):
satdump
2026-Jul-17 07:15:22 :: unmets: riscv64 +4 -0 =4
2026-Jul-17 07:15:22 :: dependencies check FAILED
2026-Jul-17 07:15:22 :: task #130131 for sisyphus_riscv64 FAILED
More information about the Riscv-reports
mailing list