[Sisyphus-mipsel-reports] [#57421] sisyphus_mipsel FAILED srpm=nfs-2.5.3-alt1.src.rpm

Girar awaiter robot awaiter at gyle-secondary.office.basealt.ru
Wed Feb 24 22:47:04 MSK 2021


2021-Feb-24 19:46:34 :: task #57421 for sisyphus_mipsel started by recycler:
#100 build nfs-2.5.3-alt1.src.rpm
2021-Feb-24 19:46:35 :: [mipsel] #100 nfs-2.5.3-alt1.src.rpm: build start
warning: line 32: Deprecated PreReq converted to Requires(pre,postun): PreReq: shadow-utils
warning: line 33: Deprecated PreReq converted to Requires(pre,postun): PreReq: nfs-utils = 1:2.5.3-alt1
warning: line 43: Deprecated PreReq converted to Requires(pre,postun): PreReq: nfs-clients = 1:2.5.3-alt1
warning: line 51: Deprecated PreReq converted to Requires(pre,postun): PreReq: control
Reading Package Lists...
Building Dependency Tree...
MI2a: mark libevent-devel
MI2a:  target libevent2.1
MI2a:   mark libevent2.1
MI2a:    target libcrypto.so.1.1
MI2a:     mark libcrypto1.1
MI2a:      target ca-certificates
MI2a:       mark ca-certificates
MI2a:        target ca-trust
MI2a:         mark ca-trust
MI2a:          target p11-kit-trust
MI2a:           mark p11-kit-trust
MI2a:            target /etc/alternatives/packages.d
MI2a:             mark alternatives
MI2a:              target rpm-macros-alternatives
MI2a:               mark rpm-macros-alternatives
MI2a:            target libtasn1.so.6
MI2a:             mark libtasn1
MI2a:            target libp11-kit
MI2a:             mark libp11-kit
MI2a:    target libssl.so.1.1
MI2a:     mark libssl1.1
MI2a: mark libdevmapper-devel
MI2a:  target libdevmapper
MI2a:   mark libdevmapper
MI2a: mark libkrb5-devel
MI2a:  target libcom_err-devel
MI2a:   mark libcom_err-devel
MI2a:    target libcom_err
MI2a:     mark libcom_err
MI2a:  target libverto-devel
MI2a:   mark libverto-devel
MI2a:    target libverto
MI2a:     mark libverto
MI2a:  target libkrb5-ldap
MI2a:   mark libkrb5-ldap
MI2a:    target libldap-2.4.so.2
MI2a:     mark libldap
MI2a:      target libsasl2.so.3
MI2a:       mark libsasl2-3
MI2a:        target libgssapi_krb5.so.2
MI2a:         mark libkrb5
MI2a:          target libkeyutils.so.1
MI2a:           mark libkeyutils
MI2a:          target liblmdb.so.0
MI2a:           mark liblmdb
MI2a:      target openldap-common
MI2a:       mark openldap-common
MI2a: mark libsqlite3-devel
MI2a:  target libsqlite3
MI2a:   mark libsqlite3
MI2a: mark libtirpc-devel
MI2a:  target libtirpc
MI2a:   mark libtirpc
E: Couldn't find package rpcgen
hsh-install: Failed to calculate package file list.
hsh-install: Failed to generate package file list.
2021-Feb-24 19:47:04 :: [mipsel] nfs-2.5.3-alt1.src.rpm: remote: cannot build src.rpm
2021-Feb-24 19:47:04 :: [mipsel] #100 nfs-2.5.3-alt1.src.rpm: build FAILED
2021-Feb-24 19:47:04 :: [mipsel] requesting cancellation of task processing
2021-Feb-24 19:47:04 :: [mipsel] build FAILED
2021-Feb-24 19:47:04 :: task #57421 for sisyphus_mipsel FAILED

More information about the Sisyphus-mipsel-reports mailing list