[Sisyphus-mipsel-reports] [#56903] p9_mipsel FAILED srpm=samba-4.12.11-alt1.src.rpm

Girar awaiter robot awaiter at gyle-secondary.office.basealt.ru
Wed Feb 10 21:17:35 MSK 2021


2021-Feb-10 18:16:45 :: task #56903 for p9_mipsel started by recycler:
#100 build samba-4.12.11-alt1.src.rpm
2021-Feb-10 18:16:46 :: [mipsel] #100 samba-4.12.11-alt1.src.rpm: build start
<13>Feb 10 18:17:26 rpmi: libgdbm-1.8.3-alt10 sisyphus_mipsel+27978.100.1.1 1557334065 installed
<13>Feb 10 18:17:26 rpmi: libexpat-2.2.10-alt1 p9_mipsel+53599.100.1.1 1605187927 installed
<13>Feb 10 18:17:26 rpmi: libp11-kit-0.23.15-alt2 p9_mipsel+51719.100.1.1 1601923392 installed
<13>Feb 10 18:17:26 rpmi: libtasn1-4.14-alt1 p9_mipsel+33250.100.1.1 1565429197 installed
<13>Feb 10 18:17:26 rpmi: rpm-macros-alternatives-0.5.1-alt1 sisyphus_mipsel+25713.100.2.1 1554890888 installed
<13>Feb 10 18:17:26 rpmi: alternatives-0.5.1-alt1 sisyphus_mipsel+25713.100.2.1 1554890888 installed
<13>Feb 10 18:17:26 rpmi: ca-certificates-2020.06.29-alt1 p9_mipsel+51794.100.1.1 1602129385 installed
<13>Feb 10 18:17:26 rpmi: ca-trust-0.1.2-alt1 p9_mipsel+31544.100.1.1 1561901557 installed
<13>Feb 10 18:17:26 rpmi: p11-kit-trust-0.23.15-alt2 p9_mipsel+51719.100.1.1 1601923392 installed
<13>Feb 10 18:17:27 rpmi: libcrypto1.1-1.1.1i-alt2 p9_mipsel+56418.100.1.1 1612209118 installed
<13>Feb 10 18:17:27 rpmi: libssl1.1-1.1.1i-alt2 p9_mipsel+56418.100.1.1 1612209118 installed
<13>Feb 10 18:17:27 rpmi: python3-3.7.4-alt3 p9_mipsel+45127.200.1.1 1587728650 installed
<13>Feb 10 18:17:27 rpmi: libpython3-3.7.4-alt3 p9_mipsel+45127.200.1.1 1587728650 installed
<13>Feb 10 18:17:29 rpmi: python3-base-3.7.4-alt3 p9_mipsel+45127.200.1.1 1587728650 installed
<13>Feb 10 18:17:29 rpmi: tests-for-installed-python3-pkgs- 1535451329 installed
<13>Feb 10 18:17:29 rpmi: rpm-build-python3- 1535451329 installed
Reading Package Lists...
Building Dependency Tree...
MI2a: mark libe2fs-devel
MI2a:  target libe2fs
MI2a:   mark libe2fs
MI2a:    target libcom_err
MI2a:     mark libcom_err
MI2a:  target libss-devel
MI2a:   mark libss-devel
MI2a:    target libcom_err-devel
MI2a:     mark libcom_err-devel
MI2a:    target libss
MI2a:     mark libss
MI2a: mark libgnutls-devel
MI2a:  target libgnutls30
MI2a:   mark libgnutls30
MI2a:    target libhogweed.so.4
MI2a:     mark libhogweed4
MI2a:      target libnettle6
MI2a:       mark libnettle6
MI2a:    target libidn2.so.0
MI2a:     mark libidn2
MI2a: mark libncurses-devel
MI2a:  target libtinfo-devel
MI2a:   mark libtinfo-devel
MI2a: mark libpam0-devel
MI2a:  target rpm-macros-pam0
MI2a:   mark rpm-macros-pam0
MI2a: mark perl-devel
MI2a:  target libdb4-devel
MI2a:   mark libdb4.7-devel
MI2a:  target libgdbm-devel
MI2a:   mark libgdbm-devel
MI2a: mark libldap-devel
MI2a:  target libldap
MI2a:   mark libldap
MI2a:    target libsasl2.so.3
MI2a:     mark libsasl2-3
MI2a:      target libgssapi_krb5.so.2
MI2a:       mark libkrb5
MI2a:        target libkeyutils.so.1
MI2a:         mark libkeyutils
MI2a:        target libverto.so.1
MI2a:         mark libverto
MI2a: mark libarchive-devel
MI2a:  target libarchive13
MI2a:   mark libarchive13
MI2a: mark libjansson-devel
MI2a:  target libjansson
MI2a:   mark libjansson
MI2a: mark libgpgme-devel
MI2a:  target libgpg-error-devel
MI2a:   mark libgpg-error-devel
MI2a:    target libgpg-error
MI2a:     mark libgpg-error
MI2a:  target pkgconfig(glib-2.0)
MI2a:   mark glib2-devel
MI2a:    target rpm-build-gir
MI2a:     mark rpm-build-gir
MI2a:      target xml-utils
MI2a:       mark xml-utils
MI2a:  target pkgconfig(libassuan)
MI2a:   mark libassuan-devel
MI2a:    target libassuan
MI2a:     mark libassuan
MI2a:  target libqgpgme7
MI2a:   mark libqgpgme7
MI2a:    target libQt5Core.so.5
MI2a:     mark libqt5-core
MI2a:      target libicui18n.so.65
MI2a:       mark libicu65
MI2a:      target libpcre2-16.so.0
MI2a:       mark libpcre2
MI2a:      target qt5-base-common
MI2a:       mark qt5-base-common
MI2a:    target libgpgmepp6
MI2a:     mark libgpgmepp6
MI2a:      target libgpgme11
MI2a:       mark libgpgme11
MI2a:        target gpgme-common
MI2a:         mark gpgme-common
MI2a:        target /usr/bin/gpg2
MI2a:         mark gnupg2
MI2a:          target bash-builtin-lockf
MI2a:           mark bash-builtin-lockf
MI2a:          target libgcrypt(vko)
MI2a:           mark libgcrypt20
MI2a:          target libksba(gost)
MI2a:           mark libksba
MI2a:          target libnpth.so.0
MI2a:           mark libnpth
MI2a:          target libsqlite3.so.0
MI2a:           mark libsqlite3
MI2a:          target libusb-1.0.so.0
MI2a:           mark libusb
MI2a:          target su
MI2a:           mark su
Selecting filesystem for '/proc'
filesystem is already the newest version.
Selecting libpam0-devel for 'libpam-devel'
rpm-build-python3 is already the newest version.
Selecting python3-dev for 'python3-devel'
Selected version libarchive-devel#3.4.3-alt1:p9_mipsel+51191.100.4.1 at 1601280549 for libarchive-devel>=3.1.2
E: Couldn't find package liburing-devel>=0.4
hsh-install: Failed to calculate package file list.
hsh-install: Failed to generate package file list.
2021-Feb-10 18:17:35 :: [mipsel] samba-4.12.11-alt1.src.rpm: remote: cannot build src.rpm
2021-Feb-10 18:17:35 :: [mipsel] #100 samba-4.12.11-alt1.src.rpm: build FAILED
2021-Feb-10 18:17:35 :: [mipsel] requesting cancellation of task processing
2021-Feb-10 18:17:35 :: [mipsel] build FAILED
2021-Feb-10 18:17:35 :: task #56903 for p9_mipsel FAILED

More information about the Sisyphus-mipsel-reports mailing list