[Sisyphus-mipsel-reports] [#56919] sisyphus_mipsel FAILED srpm=animal-sniffer-1.20-alt1.src.rpm

Girar awaiter robot awaiter at gyle-secondary.office.basealt.ru
Wed Feb 10 13:21:43 MSK 2021


2021-Feb-10 10:18:26 :: task #56919 for sisyphus_mipsel started by recycler:
#100 build animal-sniffer-1.20-alt1.src.rpm
2021-Feb-10 10:18:27 :: [mipsel] #100 animal-sniffer-1.20-alt1.src.rpm: build start
[ERROR] -> [Help 1]
[ERROR] To see the full stack trace of the errors, re-run Maven with the -e switch.
[ERROR] Re-run Maven using the -X switch to enable full debug logging.
[ERROR] For more information about the errors and possible solutions, please read the following articles:
[ERROR] [Help 1] http://cwiki.apache.org/confluence/display/MAVEN/PluginContainerException
[ERROR] After correcting the problems, you can resume the build with the command
[ERROR]   mvn <goals> -rf :java-boot-classpath-detector
2021-Feb-10 10:21:42 :: [mipsel] animal-sniffer-1.20-alt1.src.rpm: remote: build failed
2021-Feb-10 10:21:42 :: [mipsel] #100 animal-sniffer-1.20-alt1.src.rpm: build FAILED
2021-Feb-10 10:21:43 :: [mipsel] requesting cancellation of task processing
2021-Feb-10 10:21:43 :: [mipsel] build FAILED
2021-Feb-10 10:21:43 :: task #56919 for sisyphus_mipsel FAILED

More information about the Sisyphus-mipsel-reports mailing list