[Sisyphus-mipsel-reports] [#56648] sisyphus_mipsel FAILED srpm=spotifyd-0.3.0-alt1.src.rpm

Girar awaiter robot awaiter at gyle-secondary.office.basealt.ru
Wed Feb 3 13:06:37 MSK 2021


2021-Feb-03 09:51:23 :: task #56648 for sisyphus_mipsel started by recycler:
#100 build spotifyd-0.3.0-alt1.src.rpm
2021-Feb-03 09:51:24 :: [mipsel] #100 spotifyd-0.3.0-alt1.src.rpm: build start
    = note: this error originates in a macro (in Nightly builds, run with -Z macro-backtrace for more info)
error: aborting due to 2 previous errors
Some errors have detailed explanations: E0081, E0425.
For more information about an error, try `rustc --explain E0081`.
error: could not compile `nix`.
To learn more, run the command again with --verbose.
warning: build failed, waiting for other jobs to finish...
error: build failed
2021-Feb-03 10:06:37 :: [mipsel] spotifyd-0.3.0-alt1.src.rpm: remote: build failed
2021-Feb-03 10:06:37 :: [mipsel] #100 spotifyd-0.3.0-alt1.src.rpm: build FAILED
2021-Feb-03 10:06:37 :: [mipsel] requesting cancellation of task processing
2021-Feb-03 10:06:37 :: [mipsel] build FAILED
2021-Feb-03 10:06:37 :: task #56648 for sisyphus_mipsel FAILED

More information about the Sisyphus-mipsel-reports mailing list