[#412242] [test-only] FAILED (try 2) llvm22.1.git=22.1.1-alt0.1

Girar awaiter (lakostis) girar-builder at altlinux.org
Sun Mar 22 14:15:35 MSK 2026


https://git.altlinux.org/tasks/412242/logs/events.2.1.log
https://packages.altlinux.org/tasks/412242

subtask  name      aarch64   i586  x86_64
   #200  llvm22.1   failed  15:31  failed

2026-Mar-22 10:43:18 :: test-only task #412242 for sisyphus resumed by lakostis:
#100 removed
#200 build 22.1.1-alt0.1 from /people/lakostis/packages/llvm22.1.git fetched at 2026-Mar-22 10:43:02
2026-Mar-22 10:43:19 :: [aarch64] #200 llvm22.1.git 22.1.1-alt0.1: build start
2026-Mar-22 10:43:19 :: [x86_64] #200 llvm22.1.git 22.1.1-alt0.1: build start
2026-Mar-22 10:43:19 :: [i586] #200 llvm22.1.git 22.1.1-alt0.1: build start
2026-Mar-22 10:58:50 :: [i586] #200 llvm22.1.git 22.1.1-alt0.1: build OK
[x86_64]     /usr/lib/llvm-22.1/lib/clang/22/lib/x86_64-unknown-linux-gnu/libclang_rt.builtins.a
[x86_64] error: File list check failed, terminating build
[x86_64] RPM build errors:
[x86_64]     Installed (but unpackaged) file(s) found:
[x86_64]     File list check failed, terminating build
2026-Mar-22 11:01:47 :: [x86_64] llvm22.1.git 22.1.1-alt0.1: remote: build failed
2026-Mar-22 11:01:47 :: [x86_64] #200 llvm22.1.git 22.1.1-alt0.1: build FAILED
2026-Mar-22 11:01:47 :: [x86_64] requesting cancellation of task processing
[aarch64]     /usr/lib/llvm-22.1/lib/clang/22/lib/aarch64-unknown-linux-gnu/libclang_rt.builtins.a
[aarch64] error: File list check failed, terminating build
[aarch64] RPM build errors:
[aarch64]     Installed (but unpackaged) file(s) found:
[aarch64]     File list check failed, terminating build
2026-Mar-22 11:15:34 :: [aarch64] llvm22.1.git 22.1.1-alt0.1: remote: build failed
2026-Mar-22 11:15:34 :: [aarch64] #200 llvm22.1.git 22.1.1-alt0.1: build FAILED
2026-Mar-22 11:01:48 :: [x86_64] build FAILED
2026-Mar-22 11:15:34 :: [aarch64] build FAILED
2026-Mar-22 11:15:35 :: task #412242 for sisyphus FAILED


More information about the Sisyphus-incominger mailing list