[#412242] [test-only] FAILED llvm22.1.git=22.1.1-alt0.1

Girar awaiter (lakostis) girar-builder at altlinux.org
Sun Mar 22 01:36:03 MSK 2026


https://git.altlinux.org/tasks/412242/logs/events.1.1.log
https://packages.altlinux.org/tasks/412242

subtask  name      aarch64    i586  x86_64
   #100  llvm22.1   failed  failed  failed

2026-Mar-21 22:03:32 :: test-only task #412242 for sisyphus started by lakostis:
#100 build 22.1.1-alt0.1 from /people/lakostis/packages/llvm22.1.git fetched at 2026-Mar-21 22:03:00
2026-Mar-21 22:03:33 :: [x86_64] #100 llvm22.1.git 22.1.1-alt0.1: build start
2026-Mar-21 22:03:33 :: [aarch64] #100 llvm22.1.git 22.1.1-alt0.1: build start
2026-Mar-21 22:03:33 :: [i586] #100 llvm22.1.git 22.1.1-alt0.1: build start
[i586]     /usr/share/man/man1/llvm-offload-binary-22.1.xz
[i586] error: File list check failed, terminating build
[i586] RPM build errors:
[i586]     Installed (but unpackaged) file(s) found:
[i586]     File list check failed, terminating build
2026-Mar-21 22:16:31 :: [i586] llvm22.1.git 22.1.1-alt0.1: remote: build failed
2026-Mar-21 22:16:31 :: [i586] #100 llvm22.1.git 22.1.1-alt0.1: build FAILED
2026-Mar-21 22:16:31 :: [i586] requesting cancellation of task processing
[x86_64]     /usr/share/man/man1/llvm-offload-binary-22.1.xz
[x86_64] error: File list check failed, terminating build
[x86_64] RPM build errors:
[x86_64]     Installed (but unpackaged) file(s) found:
[x86_64]     File list check failed, terminating build
2026-Mar-21 22:20:09 :: [x86_64] llvm22.1.git 22.1.1-alt0.1: remote: build failed
2026-Mar-21 22:20:09 :: [x86_64] #100 llvm22.1.git 22.1.1-alt0.1: build FAILED
[aarch64]     /usr/share/man/man1/llvm-offload-binary-22.1.xz
[aarch64] error: File list check failed, terminating build
[aarch64] RPM build errors:
[aarch64]     Installed (but unpackaged) file(s) found:
[aarch64]     File list check failed, terminating build
2026-Mar-21 22:36:02 :: [aarch64] llvm22.1.git 22.1.1-alt0.1: remote: build failed
2026-Mar-21 22:36:02 :: [aarch64] #100 llvm22.1.git 22.1.1-alt0.1: build FAILED
2026-Mar-21 22:16:32 :: [i586] build FAILED
2026-Mar-21 22:20:09 :: [x86_64] build FAILED
2026-Mar-21 22:36:02 :: [aarch64] build FAILED
2026-Mar-21 22:36:02 :: task #412242 for sisyphus FAILED


More information about the Sisyphus-incominger mailing list