[#378460] [test-only] FAILED (try 4) tcc.git=0.9.27-alt5.1213.gf075851f

Girar awaiter (x1z53) girar-builder at altlinux.org
Tue Mar 18 20:56:45 MSK 2025


https://git.altlinux.org/tasks/378460/logs/events.4.1.log
https://packages.altlinux.org/tasks/378460

subtask  name  aarch64  i586  x86_64
   #300  tcc    failed  1:03    1:00

2025-Mar-18 17:55:40 :: test-only task #378460 for sisyphus resumed by x1z53:
#100 removed
#200 removed
#300 build 0.9.27-alt5.1213.gf075851f from /people/x1z53/packages/tcc.git fetched at 2025-Mar-18 17:55:31
2025-Mar-18 17:55:42 :: [i586] #300 tcc.git 0.9.27-alt5.1213.gf075851f: build start
2025-Mar-18 17:55:42 :: [aarch64] #300 tcc.git 0.9.27-alt5.1213.gf075851f: build start
2025-Mar-18 17:55:42 :: [x86_64] #300 tcc.git 0.9.27-alt5.1213.gf075851f: build start
[aarch64] ------------ dlltest ------------
[aarch64] tcc: error: library 'm' not found
[aarch64] make[2]: *** [Makefile:164: dlltest] Error 1
2025-Mar-18 17:56:38 :: [aarch64] tcc.git 0.9.27-alt5.1213.gf075851f: remote: build failed
2025-Mar-18 17:56:38 :: [aarch64] #300 tcc.git 0.9.27-alt5.1213.gf075851f: build FAILED
2025-Mar-18 17:56:38 :: [aarch64] requesting cancellation of task processing
2025-Mar-18 17:56:42 :: [x86_64] #300 tcc.git 0.9.27-alt5.1213.gf075851f: build OK
2025-Mar-18 17:56:45 :: [i586] #300 tcc.git 0.9.27-alt5.1213.gf075851f: build OK
2025-Mar-18 17:56:38 :: [aarch64] build FAILED
2025-Mar-18 17:56:45 :: task #378460 for sisyphus FAILED


More information about the Sisyphus-incominger mailing list