[#378460] [test-only] FAILED (try 3) tcc.git=0.9.27-alt5.1213.gf075851f
Girar awaiter (x1z53)
girar-builder at altlinux.org
Tue Mar 18 20:05:16 MSK 2025
https://git.altlinux.org/tasks/378460/logs/events.3.1.log
https://packages.altlinux.org/tasks/378460
subtask name aarch64 i586 x86_64
#200 tcc failed failed failed
2025-Mar-18 17:04:17 :: test-only task #378460 for sisyphus resumed by x1z53:
#100 removed
#200 build 0.9.27-alt5.1213.gf075851f from /people/x1z53/packages/tcc.git fetched at 2025-Mar-18 17:04:03
2025-Mar-18 17:04:19 :: [x86_64] #200 tcc.git 0.9.27-alt5.1213.gf075851f: build start
2025-Mar-18 17:04:19 :: [i586] #200 tcc.git 0.9.27-alt5.1213.gf075851f: build start
2025-Mar-18 17:04:19 :: [aarch64] #200 tcc.git 0.9.27-alt5.1213.gf075851f: build start
[x86_64] Processing files: tcc-0.9.27-alt5.1213.gf075851f
[x86_64] error: No such file or directory: /usr/src/tmp/tcc-buildroot/usr/bin/tcc
[x86_64] error: File not found by glob: /usr/src/tmp/tcc-buildroot/usr/lib64/tcc/libtcc*
[x86_64] error: File not found by glob: /usr/src/tmp/tcc-buildroot/usr/lib64/tcc/*.o
[x86_64] error: No such file or directory: /usr/src/tmp/tcc-buildroot/usr/lib64/tcc/include
[x86_64] error: File not found by glob: /usr/src/tmp/tcc-buildroot/usr/share/man/man1/*
[x86_64] error: File not found by glob: /usr/src/tmp/tcc-buildroot/usr/share/info/*
[x86_64] Executing(%doc): /bin/sh -e /usr/src/tmp/rpm-tmp.52545
[x86_64] --
[x86_64] RPM build errors:
[x86_64] No such file or directory: /usr/src/tmp/tcc-buildroot/usr/bin/tcc
[x86_64] File not found by glob: /usr/src/tmp/tcc-buildroot/usr/lib64/tcc/libtcc*
[x86_64] File not found by glob: /usr/src/tmp/tcc-buildroot/usr/lib64/tcc/*.o
[x86_64] No such file or directory: /usr/src/tmp/tcc-buildroot/usr/lib64/tcc/include
[x86_64] File not found by glob: /usr/src/tmp/tcc-buildroot/usr/share/man/man1/*
2025-Mar-18 17:04:57 :: [x86_64] tcc.git 0.9.27-alt5.1213.gf075851f: remote: build failed
2025-Mar-18 17:04:57 :: [x86_64] #200 tcc.git 0.9.27-alt5.1213.gf075851f: build FAILED
2025-Mar-18 17:04:57 :: [x86_64] requesting cancellation of task processing
[i586] Processing files: tcc-0.9.27-alt5.1213.gf075851f
[i586] error: No such file or directory: /usr/src/tmp/tcc-buildroot/usr/bin/tcc
[i586] error: File not found by glob: /usr/src/tmp/tcc-buildroot/usr/lib/tcc/libtcc*
[i586] error: File not found by glob: /usr/src/tmp/tcc-buildroot/usr/lib/tcc/*.o
[i586] error: No such file or directory: /usr/src/tmp/tcc-buildroot/usr/lib/tcc/include
[i586] error: File not found by glob: /usr/src/tmp/tcc-buildroot/usr/share/man/man1/*
[i586] error: File not found by glob: /usr/src/tmp/tcc-buildroot/usr/share/info/*
[i586] Executing(%doc): /bin/sh -e /usr/src/tmp/rpm-tmp.52545
[i586] --
[i586] RPM build errors:
[i586] No such file or directory: /usr/src/tmp/tcc-buildroot/usr/bin/tcc
[i586] File not found by glob: /usr/src/tmp/tcc-buildroot/usr/lib/tcc/libtcc*
[i586] File not found by glob: /usr/src/tmp/tcc-buildroot/usr/lib/tcc/*.o
[i586] No such file or directory: /usr/src/tmp/tcc-buildroot/usr/lib/tcc/include
[i586] File not found by glob: /usr/src/tmp/tcc-buildroot/usr/share/man/man1/*
2025-Mar-18 17:04:57 :: [i586] tcc.git 0.9.27-alt5.1213.gf075851f: remote: build failed
2025-Mar-18 17:04:57 :: [i586] #200 tcc.git 0.9.27-alt5.1213.gf075851f: build FAILED
[aarch64] ------------ dlltest ------------
[aarch64] tcc: error: library 'm' not found
[aarch64] make[2]: *** [Makefile:164: dlltest] Error 1
2025-Mar-18 17:05:15 :: [aarch64] tcc.git 0.9.27-alt5.1213.gf075851f: remote: build failed
2025-Mar-18 17:05:15 :: [aarch64] #200 tcc.git 0.9.27-alt5.1213.gf075851f: build FAILED
2025-Mar-18 17:04:57 :: [x86_64] build FAILED
2025-Mar-18 17:04:57 :: [i586] build FAILED
2025-Mar-18 17:05:15 :: [aarch64] build FAILED
2025-Mar-18 17:05:15 :: task #378460 for sisyphus FAILED
More information about the Sisyphus-incominger
mailing list