[#377750] [test-only] FAILED (try 2) wild.git=0.4.0-alt1
Girar awaiter (swaggyglice)
girar-builder at altlinux.org
Wed Mar 12 18:22:06 MSK 2025
https://git.altlinux.org/tasks/377750/logs/events.2.1.log
https://packages.altlinux.org/tasks/377750
subtask name aarch64 i586 x86_64
#200 wild 2:32 failed 1:33
2025-Mar-12 15:19:31 :: test-only task #377750 for sisyphus resumed by swaggyglice:
#100 removed
#200 build 0.4.0-alt1 from /people/swaggyglice/packages/wild.git fetched at 2025-Mar-12 15:19:17
2025-Mar-12 15:19:33 :: [i586] #200 wild.git 0.4.0-alt1: build start
2025-Mar-12 15:19:33 :: [x86_64] #200 wild.git 0.4.0-alt1: build start
2025-Mar-12 15:19:33 :: [aarch64] #200 wild.git 0.4.0-alt1: build start
[i586] For more information about an error, try `rustc --explain E0080`.
[i586] error: could not compile `libwild` (lib) due to 2 previous errors
[i586] Caused by:
2025-Mar-12 15:20:42 :: [i586] wild.git 0.4.0-alt1: remote: build failed
2025-Mar-12 15:20:42 :: [i586] #200 wild.git 0.4.0-alt1: build FAILED
2025-Mar-12 15:20:42 :: [i586] requesting cancellation of task processing
2025-Mar-12 15:21:06 :: [x86_64] #200 wild.git 0.4.0-alt1: build OK
2025-Mar-12 15:22:05 :: [aarch64] #200 wild.git 0.4.0-alt1: build OK
2025-Mar-12 15:20:43 :: [i586] build FAILED
2025-Mar-12 15:22:06 :: task #377750 for sisyphus FAILED
More information about the Sisyphus-incominger
mailing list