[#377750] [test-only] FAILED wild.git=0.4.0-alt1
Girar awaiter (swaggyglice)
girar-builder at altlinux.org
Wed Mar 12 18:03:18 MSK 2025
https://git.altlinux.org/tasks/377750/logs/events.1.1.log
https://packages.altlinux.org/tasks/377750
subtask name aarch64 i586 x86_64
#100 wild 2:30 failed 1:27
2025-Mar-12 15:00:45 :: test-only task #377750 for sisyphus started by swaggyglice:
#100 build 0.4.0-alt1 from /people/swaggyglice/packages/wild.git fetched at 2025-Mar-12 14:58:41
2025-Mar-12 15:00:47 :: [x86_64] #100 wild.git 0.4.0-alt1: build start
2025-Mar-12 15:00:47 :: [i586] #100 wild.git 0.4.0-alt1: build start
2025-Mar-12 15:00:47 :: [aarch64] #100 wild.git 0.4.0-alt1: build start
[i586] For more information about an error, try `rustc --explain E0080`.
[i586] error: could not compile `libwild` (lib) due to 2 previous errors
[i586] Caused by:
2025-Mar-12 15:02:00 :: [i586] wild.git 0.4.0-alt1: remote: build failed
2025-Mar-12 15:02:00 :: [i586] #100 wild.git 0.4.0-alt1: build FAILED
2025-Mar-12 15:02:00 :: [i586] requesting cancellation of task processing
2025-Mar-12 15:02:14 :: [x86_64] #100 wild.git 0.4.0-alt1: build OK
2025-Mar-12 15:03:17 :: [aarch64] #100 wild.git 0.4.0-alt1: build OK
2025-Mar-12 15:02:00 :: [i586] build FAILED
2025-Mar-12 15:03:17 :: task #377750 for sisyphus FAILED
More information about the Sisyphus-incominger
mailing list