[#377171] [test-only] p11 FAILED (try 6) libabseil-cpp.git=20250127.0-alt1 protobuf.git=3.25.5-alt6 ...

Girar awaiter (admsasha) girar-builder at altlinux.org
Fri Mar 7 16:28:14 MSK 2025


https://git.altlinux.org/tasks/377171/logs/events.6.1.log
https://packages.altlinux.org/tasks/377171

subtask  name         aarch64   i586  x86_64
  #2500  kismet          6:05   4:03    3:35
  #2600  libArcus        1:12     49      47
  #2700  libopencv      23:27  23:22   20:47
  #3000  libopenshot        ?      ?  failed

2025-Mar-07 12:56:44 :: test-only swift task #377171 for p11 resumed by admsasha:
2025-Mar-07 12:56:44 :: message: test_only
#40 build 20250127.0-alt1 from /gears/l/libabseil-cpp.git fetched at 2025-Mar-07 11:11:49 from sisyphus
#100 build 3.25.5-alt6 from /gears/p/protobuf.git fetched at 2025-Mar-07 10:51:47 from sisyphus
#200 build 5.4.0-alt1 from /gears/C/CuraEngine.git fetched at 2025-Mar-07 11:43:37 from p11
#300 build 8.0.41-alt1 from /gears/M/MySQL.git fetched at 2025-Mar-07 11:44:04 from p11
#400 build 1.1.2-alt8 from /gears/P/PokerTH.git fetched at 2025-Mar-07 11:44:07 from p11
#500 removed
#600 removed
#700 removed
#1000 build 5.8.3-alt1 from /gears/a/ayugram-desktop.git fetched at 2025-Mar-07 11:44:17 from p11
#1100 removed
#1200 removed
#1300 build 2.4.0-alt3 from /gears/c/clickhouse-cpp.git fetched at 2025-Mar-07 11:44:23 from p11
#1400 removed
#1500 removed
#1600 removed
#1700 removed
#2000 removed
#2100 removed
#2200 removed
#2300 removed
#2400 removed
#2500 build kismet-0.0.2023.07.R1-alt1_4.src.rpm from p11
#2600 build 5.3.0-alt1 from /gears/l/libArcus.git fetched at 2025-Mar-07 11:44:58 from p11
#2700 build 4.10.0-alt2 from /gears/l/libopencv.git fetched at 2025-Mar-07 11:45:03 from p11
#3000 build libopenshot-0.3.3-alt1.src.rpm from p11
#3100 build libphonenumber-8.13.54-alt1.src.rpm from p11
#3200 build 20240501-alt2 from /gears/l/libre2.git fetched at 2025-Mar-07 11:45:06 from p11
#3300 build 24.11.90-alt2 from /gears/m/marble.git fetched at 2025-Mar-07 11:45:08 from p11
#3400 build 2.4.1-alt1 from /gears/m/mixxx.git fetched at 2025-Mar-07 11:45:11 from p11
#3500 removed
#3600 build 1.4.287-alt2.3 from /gears/m/mumble.git fetched at 2025-Mar-07 11:45:13 from p11
#3700 build 20241226-alt1 from /gears/n/ncnn.git fetched at 2025-Mar-07 11:45:18 from p11
#4000 removed
#4100 removed
#4200 build percona-xtrabackup80-8.0.35-alt4.src.rpm from p11
#4300 build 1.5.0-alt1 from /gears/p/protobuf-c.git fetched at 2025-Mar-07 11:45:29 from p11
#4400 removed
#4500 build 3.40.1-alt1 from /gears/q/qgis.git fetched at 2025-Mar-07 11:45:40 from p11
#4600 removed
#4700 build 5.10.7-alt1 from /gears/t/telegram-desktop.git fetched at 2025-Mar-07 11:45:49 from p11
#5000 build 1.1.3-alt1 from /gears/u/usbguard.git fetched at 2025-Mar-07 11:45:51 from p11
#5100 build 3.0.20-alt1 from /gears/v/vlc.git fetched at 2025-Mar-07 11:45:53 from p11
#5200 build 34.0.5-alt3 from /gears/a/android-tools.git fetched at 2025-Mar-07 12:22:13 from sisyphus
#5300 build 2.31.5712-alt2_1 from /gears/f/fcitx5-mozc.git fetched at 2025-Mar-07 12:23:31 from sisyphus
#5400 build 1.70.1-alt1 from /gears/g/grpc.git fetched at 2025-Mar-07 12:24:26 from sisyphus
#5500 build 2.1.0-alt2 from /gears/a/apache-orc.git fetched at 2025-Mar-07 12:25:07 from sisyphus
#5600 build 12.0.0-alt2.3 from /gears/a/arrow.git fetched at 2025-Mar-07 12:25:43 from sisyphus
#5700 build 3.1.5-alt1 from /gears/b/bear.git fetched at 2025-Mar-07 12:25:55 from sisyphus
#6000 build 0.39.0-alt3 from /gears/s/sysdig.git fetched at 2025-Mar-07 12:26:23 from sisyphus
#6100 build 1.4.0-alt1.2 from /gears/m/mosh.git fetched at 2025-Mar-07 12:26:35 from sisyphus
#6200 build 0.9.14.2-alt3.1 from /gears/c/compiz.git fetched at 2025-Mar-07 12:26:54 from sisyphus
#6300 build 0.9.0-alt1.5 from /gears/p/purple-whatsapp.git fetched at 2025-Mar-07 12:27:08 from sisyphus
#6400 build 1.5.0-alt1_12jpp11 from /gears/o/osmpbf.git fetched at 2025-Mar-07 12:27:24 from sisyphus
#6500 build 3.7-alt1.1 from /gears/o/osgearth.git fetched at 2025-Mar-07 12:27:49 from sisyphus
#6600 build 1.4.1.32-alt1.git2e6af22d7 from /gears/c/clementine.git fetched at 2025-Mar-07 12:52:23 from sisyphus
#6700 build 11.0.1-alt1 from /gears/g/gz-msgs.git fetched at 2025-Mar-07 12:56:01 from sisyphus
#7000 build 10.0.0-alt1 from /gears/g/gz-fuel-tools.git fetched at 2025-Mar-07 12:56:09 from sisyphus
#7100 build 14.0.0-alt1 from /gears/g/gz-transport.git fetched at 2025-Mar-07 12:56:14 from sisyphus
#7200 build 9.0.0-alt2 from /gears/g/gz-sensors.git fetched at 2025-Mar-07 12:56:19 from sisyphus
#7300 build 9.0.0-alt2 from /gears/g/gz-gui.git fetched at 2025-Mar-07 12:56:24 from sisyphus
#7400 build 9.0.0-alt2 from /gears/g/gz-sim.git fetched at 2025-Mar-07 12:56:33 from sisyphus
2025-Mar-07 12:56:44 :: created build repo
2025-Mar-07 12:56:45 :: [aarch64] #40 libabseil-cpp.git 20250127.0-alt1: build start
2025-Mar-07 12:56:45 :: [x86_64] #40 libabseil-cpp.git 20250127.0-alt1: build start
2025-Mar-07 12:56:45 :: [i586] #40 libabseil-cpp.git 20250127.0-alt1: build start
2025-Mar-07 12:56:45 :: [x86_64] #40 libabseil-cpp.git 20250127.0-alt1: build swiftly SKIPPED
2025-Mar-07 12:56:45 :: [i586] #40 libabseil-cpp.git 20250127.0-alt1: build swiftly SKIPPED
2025-Mar-07 12:56:45 :: [aarch64] #40 libabseil-cpp.git 20250127.0-alt1: build swiftly SKIPPED
2025-Mar-07 12:56:46 :: [x86_64] #100 protobuf.git 3.25.5-alt6: build start
2025-Mar-07 12:56:46 :: [i586] #100 protobuf.git 3.25.5-alt6: build start
2025-Mar-07 12:56:46 :: [aarch64] #100 protobuf.git 3.25.5-alt6: build start
2025-Mar-07 12:56:46 :: [x86_64] #100 protobuf.git 3.25.5-alt6: build swiftly SKIPPED
2025-Mar-07 12:56:46 :: [i586] #100 protobuf.git 3.25.5-alt6: build swiftly SKIPPED
2025-Mar-07 12:56:46 :: [x86_64] #200 CuraEngine.git 5.4.0-alt1: build start
2025-Mar-07 12:56:46 :: [aarch64] #100 protobuf.git 3.25.5-alt6: build swiftly SKIPPED
2025-Mar-07 12:56:46 :: [i586] #200 CuraEngine.git 5.4.0-alt1: build start
2025-Mar-07 12:56:46 :: [x86_64] #200 CuraEngine.git 5.4.0-alt1: build swiftly SKIPPED
2025-Mar-07 12:56:47 :: [aarch64] #200 CuraEngine.git 5.4.0-alt1: build start
2025-Mar-07 12:56:47 :: [i586] #200 CuraEngine.git 5.4.0-alt1: build swiftly SKIPPED
2025-Mar-07 12:56:47 :: [x86_64] #300 MySQL.git 8.0.41-alt1: build start
2025-Mar-07 12:56:47 :: [i586] #300 MySQL.git 8.0.41-alt1: build start
2025-Mar-07 12:56:47 :: [aarch64] #200 CuraEngine.git 5.4.0-alt1: build swiftly SKIPPED
2025-Mar-07 12:56:47 :: [aarch64] #300 MySQL.git 8.0.41-alt1: build start
2025-Mar-07 12:56:51 :: [i586] #300 MySQL.git 8.0.41-alt1: build swiftly SKIPPED
2025-Mar-07 12:56:51 :: [x86_64] #300 MySQL.git 8.0.41-alt1: build swiftly SKIPPED
2025-Mar-07 12:56:51 :: [i586] #400 PokerTH.git 1.1.2-alt8: build start
2025-Mar-07 12:56:51 :: [x86_64] #400 PokerTH.git 1.1.2-alt8: build start
2025-Mar-07 12:56:52 :: [x86_64] #400 PokerTH.git 1.1.2-alt8: build swiftly SKIPPED
2025-Mar-07 12:56:52 :: [i586] #400 PokerTH.git 1.1.2-alt8: build swiftly SKIPPED
2025-Mar-07 12:56:52 :: [x86_64] #1000 ayugram-desktop.git 5.8.3-alt1: build start
2025-Mar-07 12:56:52 :: [i586] #1000 ayugram-desktop.git 5.8.3-alt1: build start
2025-Mar-07 12:56:53 :: [aarch64] #300 MySQL.git 8.0.41-alt1: build swiftly SKIPPED
2025-Mar-07 12:56:53 :: [aarch64] #400 PokerTH.git 1.1.2-alt8: build start
2025-Mar-07 12:56:54 :: [x86_64] #1000 ayugram-desktop.git 5.8.3-alt1: build swiftly SKIPPED
2025-Mar-07 12:56:54 :: [i586] #1000 ayugram-desktop.git 5.8.3-alt1: build swiftly SKIPPED
2025-Mar-07 12:56:54 :: [x86_64] #1300 clickhouse-cpp.git 2.4.0-alt3: build start
2025-Mar-07 12:56:54 :: [i586] #1300 clickhouse-cpp.git 2.4.0-alt3: build start
2025-Mar-07 12:56:54 :: [x86_64] #1300 clickhouse-cpp.git 2.4.0-alt3: build swiftly SKIPPED
2025-Mar-07 12:56:54 :: [i586] #1300 clickhouse-cpp.git 2.4.0-alt3: build swiftly SKIPPED
2025-Mar-07 12:56:54 :: [aarch64] #400 PokerTH.git 1.1.2-alt8: build swiftly SKIPPED
2025-Mar-07 12:56:54 :: [x86_64] #2500 kismet-0.0.2023.07.R1-alt1_4.src.rpm: build start
2025-Mar-07 12:56:54 :: [i586] #2500 kismet-0.0.2023.07.R1-alt1_4.src.rpm: build start
2025-Mar-07 12:56:54 :: [aarch64] #1000 ayugram-desktop.git 5.8.3-alt1: build start
2025-Mar-07 12:57:29 :: [aarch64] #1000 ayugram-desktop.git 5.8.3-alt1: build SKIPPED
2025-Mar-07 12:57:29 :: [aarch64] #1300 clickhouse-cpp.git 2.4.0-alt3: build start
2025-Mar-07 12:57:29 :: [aarch64] #1300 clickhouse-cpp.git 2.4.0-alt3: build swiftly SKIPPED
2025-Mar-07 12:57:30 :: [aarch64] #2500 kismet-0.0.2023.07.R1-alt1_4.src.rpm: build start
2025-Mar-07 13:00:29 :: [x86_64] #2500 kismet-0.0.2023.07.R1-alt1_4.src.rpm: build OK
2025-Mar-07 13:00:29 :: [x86_64] #2600 libArcus.git 5.3.0-alt1: build start
2025-Mar-07 13:00:57 :: [i586] #2500 kismet-0.0.2023.07.R1-alt1_4.src.rpm: build OK
2025-Mar-07 13:00:57 :: [i586] #2600 libArcus.git 5.3.0-alt1: build start
2025-Mar-07 13:01:16 :: [x86_64] #2600 libArcus.git 5.3.0-alt1: build OK
2025-Mar-07 13:01:17 :: [x86_64] #2700 libopencv.git 4.10.0-alt2: build start
2025-Mar-07 13:01:46 :: [i586] #2600 libArcus.git 5.3.0-alt1: build OK
2025-Mar-07 13:01:46 :: [i586] #2700 libopencv.git 4.10.0-alt2: build start
2025-Mar-07 13:03:35 :: [aarch64] #2500 kismet-0.0.2023.07.R1-alt1_4.src.rpm: build OK
2025-Mar-07 13:03:35 :: [aarch64] #2600 libArcus.git 5.3.0-alt1: build start
2025-Mar-07 13:04:47 :: [aarch64] #2600 libArcus.git 5.3.0-alt1: build OK
2025-Mar-07 13:04:47 :: [aarch64] #2700 libopencv.git 4.10.0-alt2: build start
2025-Mar-07 13:22:04 :: [x86_64] #2700 libopencv.git 4.10.0-alt2: build OK
2025-Mar-07 13:22:04 :: [x86_64] #3000 libopenshot-0.3.3-alt1.src.rpm: build start
[x86_64] /usr/include/google/protobuf/map.h:353:40: error: 'string_view' is not a member of 'absl'
[x86_64]   353 |                                  absl::string_view(data, integral));
[x86_64] /usr/include/google/protobuf/map.h: In member function 'google::protobuf::internal::VariantKey google::protobuf::internal::RealKeyToVariantKey<std::__cxx11::basic_string<char> >::operator()(const T&) const':
[x86_64] /usr/include/google/protobuf/map.h:382:56: error: 'ImplicitConvert' is not a member of 'google::protobuf::internal::TransparentSupport<std::__cxx11::basic_string<char> >'
[x86_64]   382 |     return VariantKey(TransparentSupport<std::string>::ImplicitConvert(value));
[x86_64] /usr/include/google/protobuf/message.h: At global scope:
[x86_64] /usr/include/google/protobuf/message.h:881:57: error: 'absl::string_view' has not been declared
[x86_64]   881 |   const FieldDescriptor* FindKnownExtensionByName(absl::string_view name) const;
[x86_64] In file included from /usr/src/RPM/BUILD/libopenshot-0.3.3/x86_64-alt-linux/src/objdetectdata.pb.h:37:
[x86_64] /usr/include/google/protobuf/timestamp.pb.h:188:18: error: 'string_view' in namespace 'absl' does not name a type
[x86_64]   188 |   static ::absl::string_view FullMessageName() {
[x86_64] /usr/src/RPM/BUILD/libopenshot-0.3.3/x86_64-alt-linux/src/objdetectdata.pb.h:196:18: error: 'string_view' in namespace 'absl' does not name a type
[x86_64]   196 |   static ::absl::string_view FullMessageName() {
[x86_64] /usr/src/RPM/BUILD/libopenshot-0.3.3/x86_64-alt-linux/src/objdetectdata.pb.h:443:18: error: 'string_view' in namespace 'absl' does not name a type
[x86_64]   443 |   static ::absl::string_view FullMessageName() {
[x86_64] /usr/src/RPM/BUILD/libopenshot-0.3.3/x86_64-alt-linux/src/objdetectdata.pb.h:640:18: error: 'string_view' in namespace 'absl' does not name a type
[x86_64]   640 |   static ::absl::string_view FullMessageName() {
[x86_64] /usr/src/RPM/BUILD/libopenshot-0.3.3/x86_64-alt-linux/src/objdetectdata.pb.h:693:40: error: 'absl::string_view' has not been declared
[x86_64]   693 |   void set_classnames(int index, absl::string_view value);
[x86_64] /usr/src/RPM/BUILD/libopenshot-0.3.3/x86_64-alt-linux/src/objdetectdata.pb.h:699:29: error: 'absl::string_view' has not been declared
[x86_64]   699 |   void add_classnames(absl::string_view value);
[x86_64] /usr/src/RPM/BUILD/libopenshot-0.3.3/x86_64-alt-linux/src/objdetectdata.pb.h:1201:56: error: 'absl::string_view' has not been declared
[x86_64]  1201 | inline void ObjDetect::set_classnames(int index, absl::string_view value) {
2025-Mar-07 13:23:06 :: [x86_64] libopenshot-0.3.3-alt1.src.rpm: remote: build failed
2025-Mar-07 13:23:06 :: [x86_64] #3000 libopenshot-0.3.3-alt1.src.rpm: build FAILED
2025-Mar-07 13:23:06 :: [x86_64] requesting cancellation of task processing
2025-Mar-07 13:25:08 :: [i586] #2700 libopencv.git 4.10.0-alt2: build OK
2025-Mar-07 13:25:09 :: [i586] task processing CANCELLED
2025-Mar-07 13:28:14 :: [aarch64] #2700 libopencv.git 4.10.0-alt2: build OK
2025-Mar-07 13:28:14 :: [aarch64] task processing CANCELLED
2025-Mar-07 13:23:07 :: [x86_64] build FAILED
2025-Mar-07 13:25:09 :: [i586] build FAILED
2025-Mar-07 13:28:14 :: [aarch64] build FAILED
2025-Mar-07 13:28:14 :: task #377171 for p11 FAILED


More information about the Sisyphus-incominger mailing list