[#377171] [test-only] p11 FAILED (try 5) libabseil-cpp.git=20250127.0-alt1 protobuf.git=3.25.5-alt6 ...

Girar awaiter (admsasha) girar-builder at altlinux.org
Fri Mar 7 15:54:13 MSK 2025


https://git.altlinux.org/tasks/377171/logs/events.5.1.log
https://packages.altlinux.org/tasks/377171

subtask  name            aarch64    i586  x86_64
  #1300  clickhouse-cpp       59      41      43
  #1700  gz-fuel-tools         ?  failed  failed

2025-Mar-07 12:52:31 :: test-only swift task #377171 for p11 resumed by admsasha:
2025-Mar-07 12:52:31 :: message: test_only
#40 build 20250127.0-alt1 from /gears/l/libabseil-cpp.git fetched at 2025-Mar-07 11:11:49 from sisyphus
#100 build 3.25.5-alt6 from /gears/p/protobuf.git fetched at 2025-Mar-07 10:51:47 from sisyphus
#200 build 5.4.0-alt1 from /gears/C/CuraEngine.git fetched at 2025-Mar-07 11:43:37 from p11
#300 build 8.0.41-alt1 from /gears/M/MySQL.git fetched at 2025-Mar-07 11:44:04 from p11
#400 build 1.1.2-alt8 from /gears/P/PokerTH.git fetched at 2025-Mar-07 11:44:07 from p11
#500 removed
#600 removed
#700 removed
#1000 build 5.8.3-alt1 from /gears/a/ayugram-desktop.git fetched at 2025-Mar-07 11:44:17 from p11
#1100 removed
#1200 removed
#1300 build 2.4.0-alt3 from /gears/c/clickhouse-cpp.git fetched at 2025-Mar-07 11:44:23 from p11
#1400 removed
#1500 removed
#1600 removed
#1700 build 10.0.0-alt1 from /gears/g/gz-fuel-tools.git fetched at 2025-Mar-07 11:44:52 from p11
#2000 build 9.0.0-alt1 from /gears/g/gz-gui.git fetched at 2025-Mar-07 11:44:52 from p11
#2100 build 11.0.1-alt1 from /gears/g/gz-msgs.git fetched at 2025-Mar-07 11:44:53 from p11
#2200 build 9.0.0-alt1 from /gears/g/gz-sensors.git fetched at 2025-Mar-07 11:44:54 from p11
#2300 build 9.0.0-alt1 from /gears/g/gz-sim.git fetched at 2025-Mar-07 11:44:56 from p11
#2400 build 14.0.0-alt1 from /gears/g/gz-transport.git fetched at 2025-Mar-07 11:44:56 from p11
#2500 build kismet-0.0.2023.07.R1-alt1_4.src.rpm from p11
#2600 build 5.3.0-alt1 from /gears/l/libArcus.git fetched at 2025-Mar-07 11:44:58 from p11
#2700 build 4.10.0-alt2 from /gears/l/libopencv.git fetched at 2025-Mar-07 11:45:03 from p11
#3000 build libopenshot-0.3.3-alt1.src.rpm from p11
#3100 build libphonenumber-8.13.54-alt1.src.rpm from p11
#3200 build 20240501-alt2 from /gears/l/libre2.git fetched at 2025-Mar-07 11:45:06 from p11
#3300 build 24.11.90-alt2 from /gears/m/marble.git fetched at 2025-Mar-07 11:45:08 from p11
#3400 build 2.4.1-alt1 from /gears/m/mixxx.git fetched at 2025-Mar-07 11:45:11 from p11
#3500 removed
#3600 build 1.4.287-alt2.3 from /gears/m/mumble.git fetched at 2025-Mar-07 11:45:13 from p11
#3700 build 20241226-alt1 from /gears/n/ncnn.git fetched at 2025-Mar-07 11:45:18 from p11
#4000 removed
#4100 removed
#4200 build percona-xtrabackup80-8.0.35-alt4.src.rpm from p11
#4300 build 1.5.0-alt1 from /gears/p/protobuf-c.git fetched at 2025-Mar-07 11:45:29 from p11
#4400 removed
#4500 build 3.40.1-alt1 from /gears/q/qgis.git fetched at 2025-Mar-07 11:45:40 from p11
#4600 removed
#4700 build 5.10.7-alt1 from /gears/t/telegram-desktop.git fetched at 2025-Mar-07 11:45:49 from p11
#5000 build 1.1.3-alt1 from /gears/u/usbguard.git fetched at 2025-Mar-07 11:45:51 from p11
#5100 build 3.0.20-alt1 from /gears/v/vlc.git fetched at 2025-Mar-07 11:45:53 from p11
#5200 build 34.0.5-alt3 from /gears/a/android-tools.git fetched at 2025-Mar-07 12:22:13 from sisyphus
#5300 build 2.31.5712-alt2_1 from /gears/f/fcitx5-mozc.git fetched at 2025-Mar-07 12:23:31 from sisyphus
#5400 build 1.70.1-alt1 from /gears/g/grpc.git fetched at 2025-Mar-07 12:24:26 from sisyphus
#5500 build 2.1.0-alt2 from /gears/a/apache-orc.git fetched at 2025-Mar-07 12:25:07 from sisyphus
#5600 build 12.0.0-alt2.3 from /gears/a/arrow.git fetched at 2025-Mar-07 12:25:43 from sisyphus
#5700 build 3.1.5-alt1 from /gears/b/bear.git fetched at 2025-Mar-07 12:25:55 from sisyphus
#6000 build 0.39.0-alt3 from /gears/s/sysdig.git fetched at 2025-Mar-07 12:26:23 from sisyphus
#6100 build 1.4.0-alt1.2 from /gears/m/mosh.git fetched at 2025-Mar-07 12:26:35 from sisyphus
#6200 build 0.9.14.2-alt3.1 from /gears/c/compiz.git fetched at 2025-Mar-07 12:26:54 from sisyphus
#6300 build 0.9.0-alt1.5 from /gears/p/purple-whatsapp.git fetched at 2025-Mar-07 12:27:08 from sisyphus
#6400 build 1.5.0-alt1_12jpp11 from /gears/o/osmpbf.git fetched at 2025-Mar-07 12:27:24 from sisyphus
#6500 build 3.7-alt1.1 from /gears/o/osgearth.git fetched at 2025-Mar-07 12:27:49 from sisyphus
#6600 build 1.4.1.32-alt1.git2e6af22d7 from /gears/c/clementine.git fetched at 2025-Mar-07 12:52:23 from sisyphus
2025-Mar-07 12:52:32 :: created build repo
2025-Mar-07 12:52:33 :: [i586] #40 libabseil-cpp.git 20250127.0-alt1: build start
2025-Mar-07 12:52:33 :: [aarch64] #40 libabseil-cpp.git 20250127.0-alt1: build start
2025-Mar-07 12:52:33 :: [x86_64] #40 libabseil-cpp.git 20250127.0-alt1: build start
2025-Mar-07 12:52:34 :: [i586] #40 libabseil-cpp.git 20250127.0-alt1: build swiftly SKIPPED
2025-Mar-07 12:52:34 :: [x86_64] #40 libabseil-cpp.git 20250127.0-alt1: build swiftly SKIPPED
2025-Mar-07 12:52:34 :: [aarch64] #40 libabseil-cpp.git 20250127.0-alt1: build swiftly SKIPPED
2025-Mar-07 12:52:34 :: [x86_64] #100 protobuf.git 3.25.5-alt6: build start
2025-Mar-07 12:52:34 :: [i586] #100 protobuf.git 3.25.5-alt6: build start
2025-Mar-07 12:52:34 :: [aarch64] #100 protobuf.git 3.25.5-alt6: build start
2025-Mar-07 12:52:34 :: [i586] #100 protobuf.git 3.25.5-alt6: build swiftly SKIPPED
2025-Mar-07 12:52:34 :: [x86_64] #100 protobuf.git 3.25.5-alt6: build swiftly SKIPPED
2025-Mar-07 12:52:35 :: [i586] #200 CuraEngine.git 5.4.0-alt1: build start
2025-Mar-07 12:52:35 :: [x86_64] #200 CuraEngine.git 5.4.0-alt1: build start
2025-Mar-07 12:52:35 :: [aarch64] #100 protobuf.git 3.25.5-alt6: build swiftly SKIPPED
2025-Mar-07 12:52:35 :: [aarch64] #200 CuraEngine.git 5.4.0-alt1: build start
2025-Mar-07 12:52:35 :: [x86_64] #200 CuraEngine.git 5.4.0-alt1: build swiftly SKIPPED
2025-Mar-07 12:52:35 :: [i586] #200 CuraEngine.git 5.4.0-alt1: build swiftly SKIPPED
2025-Mar-07 12:52:35 :: [i586] #300 MySQL.git 8.0.41-alt1: build start
2025-Mar-07 12:52:35 :: [x86_64] #300 MySQL.git 8.0.41-alt1: build start
2025-Mar-07 12:52:35 :: [aarch64] #200 CuraEngine.git 5.4.0-alt1: build swiftly SKIPPED
2025-Mar-07 12:52:35 :: [aarch64] #300 MySQL.git 8.0.41-alt1: build start
2025-Mar-07 12:52:39 :: [i586] #300 MySQL.git 8.0.41-alt1: build swiftly SKIPPED
2025-Mar-07 12:52:39 :: [x86_64] #300 MySQL.git 8.0.41-alt1: build swiftly SKIPPED
2025-Mar-07 12:52:39 :: [i586] #400 PokerTH.git 1.1.2-alt8: build start
2025-Mar-07 12:52:40 :: [x86_64] #400 PokerTH.git 1.1.2-alt8: build start
2025-Mar-07 12:52:40 :: [i586] #400 PokerTH.git 1.1.2-alt8: build swiftly SKIPPED
2025-Mar-07 12:52:40 :: [x86_64] #400 PokerTH.git 1.1.2-alt8: build swiftly SKIPPED
2025-Mar-07 12:52:40 :: [i586] #1000 ayugram-desktop.git 5.8.3-alt1: build start
2025-Mar-07 12:52:40 :: [x86_64] #1000 ayugram-desktop.git 5.8.3-alt1: build start
2025-Mar-07 12:52:41 :: [i586] #1000 ayugram-desktop.git 5.8.3-alt1: build swiftly SKIPPED
2025-Mar-07 12:52:41 :: [x86_64] #1000 ayugram-desktop.git 5.8.3-alt1: build swiftly SKIPPED
2025-Mar-07 12:52:42 :: [aarch64] #300 MySQL.git 8.0.41-alt1: build swiftly SKIPPED
2025-Mar-07 12:52:42 :: [i586] #1300 clickhouse-cpp.git 2.4.0-alt3: build start
2025-Mar-07 12:52:42 :: [x86_64] #1300 clickhouse-cpp.git 2.4.0-alt3: build start
2025-Mar-07 12:52:42 :: [aarch64] #400 PokerTH.git 1.1.2-alt8: build start
2025-Mar-07 12:52:43 :: [aarch64] #400 PokerTH.git 1.1.2-alt8: build swiftly SKIPPED
2025-Mar-07 12:52:43 :: [aarch64] #1000 ayugram-desktop.git 5.8.3-alt1: build start
2025-Mar-07 12:53:13 :: [aarch64] #1000 ayugram-desktop.git 5.8.3-alt1: build SKIPPED
2025-Mar-07 12:53:13 :: [aarch64] #1300 clickhouse-cpp.git 2.4.0-alt3: build start
2025-Mar-07 12:53:23 :: [i586] #1300 clickhouse-cpp.git 2.4.0-alt3: build OK
2025-Mar-07 12:53:24 :: [i586] #1700 gz-fuel-tools.git 10.0.0-alt1: build start
2025-Mar-07 12:53:25 :: [x86_64] #1300 clickhouse-cpp.git 2.4.0-alt3: build OK
2025-Mar-07 12:53:25 :: [x86_64] #1700 gz-fuel-tools.git 10.0.0-alt1: build start
[x86_64] /usr/include/gz/msgs11/gz/msgs/PointCloudPackedUtils.hh:63:38: error: 'gz::msgs::PointCloudPacked::Field' has not been declared
[x86_64]    63 |         case msgs::PointCloudPacked::Field::UINT8:
[x86_64] /usr/include/gz/msgs11/gz/msgs/PointCloudPackedUtils.hh:66:38: error: 'gz::msgs::PointCloudPacked::Field' has not been declared
[x86_64]    66 |         case msgs::PointCloudPacked::Field::INT16:
[x86_64] /usr/include/gz/msgs11/gz/msgs/PointCloudPackedUtils.hh:67:38: error: 'gz::msgs::PointCloudPacked::Field' has not been declared
[x86_64]    67 |         case msgs::PointCloudPacked::Field::UINT16:
[x86_64] /usr/include/gz/msgs11/gz/msgs/PointCloudPackedUtils.hh:70:38: error: 'gz::msgs::PointCloudPacked::Field' has not been declared
[x86_64]    70 |         case msgs::PointCloudPacked::Field::INT32:
[x86_64] /usr/include/gz/msgs11/gz/msgs/PointCloudPackedUtils.hh:71:38: error: 'gz::msgs::PointCloudPacked::Field' has not been declared
[x86_64]    71 |         case msgs::PointCloudPacked::Field::UINT32:
[x86_64] /usr/include/gz/msgs11/gz/msgs/PointCloudPackedUtils.hh:72:38: error: 'gz::msgs::PointCloudPacked::Field' has not been declared
[x86_64]    72 |         case msgs::PointCloudPacked::Field::FLOAT32:
[x86_64] /usr/include/gz/msgs11/gz/msgs/PointCloudPackedUtils.hh:75:38: error: 'gz::msgs::PointCloudPacked::Field' has not been declared
[x86_64]    75 |         case msgs::PointCloudPacked::Field::FLOAT64:
[x86_64] /usr/include/gz/msgs11/gz/msgs/PointCloudPackedUtils.hh: In function 'void gz::msgs::InitPointCloudPacked(...)':
[x86_64] /usr/include/gz/msgs11/gz/msgs/PointCloudPackedUtils.hh:52:5: error: cannot convert 'gz::msgs::InitPointCloudPacked(...)::<lambda(const std::string&, int)>' to 'int' in initialization
[x86_64]    52 |     [&](const std::string &_name,
[x86_64] --
[x86_64]    85 |     };
[x86_64] /usr/include/gz/msgs11/gz/msgs/PointCloudPackedUtils.hh:88:3: error: invalid use of incomplete type 'class gz::msgs::PointCloudPacked'
[x86_64]    88 |   _msg.mutable_header()->clear_data();
[x86_64] --
[x86_64]    51 | class PointCloudPacked;
[x86_64] /usr/include/gz/msgs11/gz/msgs/PointCloudPackedUtils.hh:89:17: error: incomplete type 'gz::msgs::Header' used in nested name specifier
[x86_64]    89 |   msgs::Header::Map *frame = _msg.mutable_header()->add_data();
2025-Mar-07 12:54:05 :: [x86_64] gz-fuel-tools.git 10.0.0-alt1: remote: build failed
2025-Mar-07 12:54:05 :: [x86_64] #1700 gz-fuel-tools.git 10.0.0-alt1: build FAILED
2025-Mar-07 12:54:05 :: [x86_64] requesting cancellation of task processing
[i586]    85 |     };
[i586] /usr/include/gz/msgs11/gz/msgs/PointCloudPackedUtils.hh:88:3: error: invalid use of incomplete type 'class gz::msgs::PointCloudPacked'
[i586]    88 |   _msg.mutable_header()->clear_data();
[i586] --
[i586]    51 | class PointCloudPacked;
[i586] /usr/include/gz/msgs11/gz/msgs/PointCloudPackedUtils.hh:89:17: error: incomplete type 'gz::msgs::Header' used in nested name specifier
[i586]    89 |   msgs::Header::Map *frame = _msg.mutable_header()->add_data();
[i586] /usr/include/gz/msgs11/gz/msgs/PointCloudPackedUtils.hh:89:22: error: 'frame' was not declared in this scope
[i586]    89 |   msgs::Header::Map *frame = _msg.mutable_header()->add_data();
[i586] /usr/include/gz/msgs11/gz/msgs/PointCloudPackedUtils.hh:89:30: error: invalid use of incomplete type 'class gz::msgs::PointCloudPacked'
[i586]    89 |   msgs::Header::Map *frame = _msg.mutable_header()->add_data();
[i586] --
[i586]    51 | class PointCloudPacked;
[i586] /usr/include/gz/msgs11/gz/msgs/PointCloudPackedUtils.hh:93:3: error: invalid use of incomplete type 'class gz::msgs::PointCloudPacked'
[i586]    93 |   _msg.clear_field();
[i586] --
[i586]    51 | class PointCloudPacked;
[i586] /usr/include/gz/msgs11/gz/msgs/PointCloudPackedUtils.hh:96:32: error: incomplete type 'gz::msgs::PointCloudPacked' used in nested name specifier
[i586]    96 |        msgs::PointCloudPacked::Field::DataType> &field : _fields)
[i586] /usr/include/gz/msgs11/gz/msgs/PointCloudPackedUtils.hh:96:47: error: template argument 2 is invalid
[i586]    96 |        msgs::PointCloudPacked::Field::DataType> &field : _fields)
[i586] /usr/include/gz/msgs11/gz/msgs/PointCloudPackedUtils.hh:96:58: error: '_fields' was not declared in this scope; did you mean 'field'?
[i586]    96 |        msgs::PointCloudPacked::Field::DataType> &field : _fields)
[i586]       |                                                          field
[i586] /usr/include/gz/msgs11/gz/msgs/PointCloudPackedUtils.hh:98:15: error: request for member 'first' in 'field', which is of non-class type 'const int'
[i586]    98 |     if (field.first == "xyz")
[i586] /usr/include/gz/msgs11/gz/msgs/PointCloudPackedUtils.hh:100:45: error: request for member 'second' in 'field', which is of non-class type 'const int'
[i586]   100 |       initPointCloudPackedHelper("x", field.second);
2025-Mar-07 12:54:07 :: [i586] gz-fuel-tools.git 10.0.0-alt1: remote: build failed
2025-Mar-07 12:54:07 :: [i586] #1700 gz-fuel-tools.git 10.0.0-alt1: build FAILED
2025-Mar-07 12:54:12 :: [aarch64] #1300 clickhouse-cpp.git 2.4.0-alt3: build OK
2025-Mar-07 12:54:13 :: [aarch64] task processing CANCELLED
2025-Mar-07 12:54:05 :: [x86_64] build FAILED
2025-Mar-07 12:54:07 :: [i586] build FAILED
2025-Mar-07 12:54:13 :: [aarch64] build FAILED
2025-Mar-07 12:54:13 :: task #377171 for p11 FAILED


More information about the Sisyphus-incominger mailing list