[#369666] [test-only] FAILED (try 2) alterator-entry.git=0.2.4-alt2
Girar awaiter (chernigin)
girar-builder at altlinux.org
Wed Mar 5 16:18:27 MSK 2025
https://git.altlinux.org/tasks/369666/logs/events.2.1.log
https://packages.altlinux.org/tasks/369666
subtask name aarch64 i586 ppc64le x86_64
#200 alterator-entry failed failed failed failed
2025-Mar-05 13:17:45 :: test-only task #369666 for sisyphus resumed by chernigin:
#100 removed
#200 build 0.2.4-alt2 from /people/chernigin/packages/alterator-entry.git fetched at 2025-Mar-05 13:17:35
2025-Mar-05 13:17:46 :: [x86_64] #200 alterator-entry.git 0.2.4-alt2: build start
2025-Mar-05 13:17:46 :: [aarch64] #200 alterator-entry.git 0.2.4-alt2: build start
2025-Mar-05 13:17:46 :: [i586] #200 alterator-entry.git 0.2.4-alt2: build start
2025-Mar-05 13:17:46 :: [ppc64le] #200 alterator-entry.git 0.2.4-alt2: build start
[x86_64] import tomlkit
[x86_64] ModuleNotFoundError: No module named 'tomlkit'
2025-Mar-05 13:18:07 :: [x86_64] alterator-entry.git 0.2.4-alt2: remote: build failed
2025-Mar-05 13:18:07 :: [x86_64] #200 alterator-entry.git 0.2.4-alt2: build FAILED
2025-Mar-05 13:18:07 :: [x86_64] requesting cancellation of task processing
[i586] import tomlkit
[i586] ModuleNotFoundError: No module named 'tomlkit'
2025-Mar-05 13:18:08 :: [i586] alterator-entry.git 0.2.4-alt2: remote: build failed
2025-Mar-05 13:18:08 :: [i586] #200 alterator-entry.git 0.2.4-alt2: build FAILED
[aarch64] import tomlkit
[aarch64] ModuleNotFoundError: No module named 'tomlkit'
2025-Mar-05 13:18:22 :: [aarch64] alterator-entry.git 0.2.4-alt2: remote: build failed
2025-Mar-05 13:18:22 :: [aarch64] #200 alterator-entry.git 0.2.4-alt2: build FAILED
[ppc64le] import tomlkit
[ppc64le] ModuleNotFoundError: No module named 'tomlkit'
2025-Mar-05 13:18:26 :: [ppc64le] alterator-entry.git 0.2.4-alt2: remote: build failed
2025-Mar-05 13:18:26 :: [ppc64le] #200 alterator-entry.git 0.2.4-alt2: build FAILED
2025-Mar-05 13:18:07 :: [x86_64] build FAILED
2025-Mar-05 13:18:08 :: [i586] build FAILED
2025-Mar-05 13:18:22 :: [aarch64] build FAILED
2025-Mar-05 13:18:26 :: [ppc64le] build FAILED
2025-Mar-05 13:18:26 :: task #369666 for sisyphus FAILED
More information about the Sisyphus-incominger
mailing list