[#369666] [test-only] FAILED alterator-entry.git=0.2.4-alt2

Girar awaiter (chernigin) girar-builder at altlinux.org
Wed Mar 5 15:50:31 MSK 2025


https://git.altlinux.org/tasks/369666/logs/events.1.1.log
https://packages.altlinux.org/tasks/369666

subtask  name             aarch64    i586  ppc64le  x86_64
   #100  alterator-entry   failed  failed   failed  failed

2025-Mar-05 12:49:48 :: test-only task #369666 for sisyphus started by chernigin:
#100 build 0.2.4-alt2 from /people/chernigin/packages/alterator-entry.git fetched at 2025-Mar-05 12:49:32
2025-Mar-05 12:49:49 :: [x86_64] #100 alterator-entry.git 0.2.4-alt2: build start
2025-Mar-05 12:49:49 :: [ppc64le] #100 alterator-entry.git 0.2.4-alt2: build start
2025-Mar-05 12:49:49 :: [aarch64] #100 alterator-entry.git 0.2.4-alt2: build start
2025-Mar-05 12:49:49 :: [i586] #100 alterator-entry.git 0.2.4-alt2: build start
[x86_64]     import tomlkit
[x86_64] ModuleNotFoundError: No module named 'tomlkit'
2025-Mar-05 12:50:10 :: [x86_64] alterator-entry.git 0.2.4-alt2: remote: build failed
2025-Mar-05 12:50:11 :: [x86_64] #100 alterator-entry.git 0.2.4-alt2: build FAILED
2025-Mar-05 12:50:11 :: [x86_64] requesting cancellation of task processing
[i586]     import tomlkit
[i586] ModuleNotFoundError: No module named 'tomlkit'
2025-Mar-05 12:50:11 :: [i586] alterator-entry.git 0.2.4-alt2: remote: build failed
2025-Mar-05 12:50:11 :: [i586] #100 alterator-entry.git 0.2.4-alt2: build FAILED
[ppc64le]     import tomlkit
[ppc64le] ModuleNotFoundError: No module named 'tomlkit'
2025-Mar-05 12:50:28 :: [ppc64le] alterator-entry.git 0.2.4-alt2: remote: build failed
2025-Mar-05 12:50:28 :: [ppc64le] #100 alterator-entry.git 0.2.4-alt2: build FAILED
[aarch64]     import tomlkit
[aarch64] ModuleNotFoundError: No module named 'tomlkit'
2025-Mar-05 12:50:31 :: [aarch64] alterator-entry.git 0.2.4-alt2: remote: build failed
2025-Mar-05 12:50:31 :: [aarch64] #100 alterator-entry.git 0.2.4-alt2: build FAILED
2025-Mar-05 12:50:11 :: [x86_64] build FAILED
2025-Mar-05 12:50:11 :: [i586] build FAILED
2025-Mar-05 12:50:28 :: [ppc64le] build FAILED
2025-Mar-05 12:50:31 :: [aarch64] build FAILED
2025-Mar-05 12:50:31 :: task #369666 for sisyphus FAILED


More information about the Sisyphus-incominger mailing list