[#382791] p10 FAILED u-boot-repka4.git=2020.04.rc3.1-alt2
Girar awaiter (antohami)
girar-builder at altlinux.org
Tue Apr 29 05:05:50 MSK 2025
https://git.altlinux.org/tasks/382791/logs/events.1.1.log
https://packages.altlinux.org/tasks/382791
subtask name aarch64 armh i586 x86_64
#100 u-boot-repka4 failed - - -
2025-Apr-29 02:05:01 :: task #382791 for p10 started by antohami:
2025-Apr-29 02:05:01 :: message: for_buildable_uboot_list
#100 build 2020.04.rc3.1-alt2 from /gears/u/u-boot-repka4.git fetched at 2025-Apr-29 02:04:59 from sisyphus
2025-Apr-29 02:05:03 :: [armh] #100 u-boot-repka4.git 2020.04.rc3.1-alt2: build start
2025-Apr-29 02:05:03 :: [x86_64] #100 u-boot-repka4.git 2020.04.rc3.1-alt2: build start
2025-Apr-29 02:05:03 :: [aarch64] #100 u-boot-repka4.git 2020.04.rc3.1-alt2: build start
2025-Apr-29 02:05:03 :: [i586] #100 u-boot-repka4.git 2020.04.rc3.1-alt2: build start
2025-Apr-29 02:05:14 :: [i586] #100 u-boot-repka4.git 2020.04.rc3.1-alt2: build SKIPPED
2025-Apr-29 02:05:14 :: [x86_64] #100 u-boot-repka4.git 2020.04.rc3.1-alt2: build SKIPPED
2025-Apr-29 02:05:25 :: [armh] #100 u-boot-repka4.git 2020.04.rc3.1-alt2: build SKIPPED
[aarch64] <13>Apr 29 02:05:20 rpmi: libgdbm-1.8.3-alt10 sisyphus+278100.1600.1.1 1626059407 installed
[aarch64] <13>Apr 29 02:05:20 rpmi: libgdbm-devel-1.8.3-alt10 sisyphus+278100.1600.1.1 1626059407 installed
[aarch64] <13>Apr 29 02:05:21 rpmi: perl-devel-1:5.34.3-alt1.p10.1 p10+381276.100.1.1 1744363393 installed
[aarch64] <13>Apr 29 02:05:21 rpmi: swig-data-1:4.0.2-alt4.2.p10 p10+345454.100.2.1 1713792291 installed
[aarch64] <13>Apr 29 02:05:21 rpmi: libncurses-6.3.20220618-alt1 p10+319472.100.4.1 1685092875 installed
[aarch64] <13>Apr 29 02:05:21 rpmi: libtinfo-devel-6.3.20220618-alt1 p10+319472.100.4.1 1685092875 installed
[aarch64] <13>Apr 29 02:05:21 rpmi: libncurses-devel-6.3.20220618-alt1 p10+319472.100.4.1 1685092875 installed
[aarch64] <13>Apr 29 02:05:21 rpmi: libexpat-2.5.0-alt1 p10+324220.100.1.1 1688465160 installed
[aarch64] <13>Apr 29 02:05:21 rpmi: libfdt-1.7.0-alt1 p10+321662.100.3.1 1687281552 installed
[aarch64] <13>Apr 29 02:05:21 rpmi: libp11-kit-0.24.1-alt1 p10+305061.100.3.1 1660573491 installed
[aarch64] <13>Apr 29 02:05:21 rpmi: libtasn1-4.20.0-alt1 p10+374934.100.1.1 1739780119 installed
[aarch64] <13>Apr 29 02:05:21 rpmi: rpm-macros-alternatives-0.5.2-alt1 p10+309129.100.2.1 1668066636 installed
[aarch64] <13>Apr 29 02:05:21 rpmi: alternatives-0.5.2-alt1 p10+309129.100.2.1 1668066636 installed
[aarch64] <13>Apr 29 02:05:21 rpmi: ca-certificates-2024.12.10-alt1 p10+372243.20.2.1 1738332466 installed
[aarch64] <13>Apr 29 02:05:21 rpmi: ca-trust-0.1.6-alt1 p10+344774.100.1.1 1712685728 installed
[aarch64] <13>Apr 29 02:05:21 rpmi: p11-kit-trust-0.24.1-alt1 p10+305061.100.3.1 1660573491 installed
[aarch64] <13>Apr 29 02:05:21 rpmi: libcrypto1.1-1.1.1w-alt0.p10.2 p10+364728.100.2.1 1734595255 installed
[aarch64] <13>Apr 29 02:05:21 rpmi: libssl1.1-1.1.1w-alt0.p10.2 p10+364728.100.2.1 1734595255 installed
[aarch64] <13>Apr 29 02:05:21 rpmi: python3-3.9.20-alt1 p10+357900.100.1.1 1726760090 installed
[aarch64] <13>Apr 29 02:05:22 rpmi: python3-base-3.9.20-alt1 p10+357900.100.1.1 1726760090 installed
[aarch64] <13>Apr 29 02:05:22 rpmi: libpython3-3.9.20-alt1 p10+357900.100.1.1 1726760090 installed
[aarch64] <13>Apr 29 02:05:22 rpmi: python3-module-pkg_resources-1:57.4.0-alt1.p10.1 p10+362900.200.1.1 1732008795 installed
[aarch64] <13>Apr 29 02:05:22 rpmi: tests-for-installed-python3-pkgs-0.1.22-alt1 p10+325520.200.7.1 1691156214 installed
[aarch64] <13>Apr 29 02:05:22 rpmi: rpm-build-python3-0.1.22-alt1 p10+325520.200.7.1 1691156214 installed
[aarch64] <13>Apr 29 02:05:23 rpmi: python3-dev-3.9.20-alt1 p10+357900.100.1.1 1726760090 installed
[aarch64] <13>Apr 29 02:05:24 rpmi: python3-module-setuptools-1:57.4.0-alt1.p10.1 p10+362900.200.1.1 1732008795 installed
[aarch64] <13>Apr 29 02:05:24 rpmi: dtc-1.7.0-alt1 p10+321662.100.3.1 1687281552 installed
[aarch64] <13>Apr 29 02:05:24 rpmi: swig-1:4.0.2-alt4.2.p10 p10+345454.100.2.1 1713793212 installed
[aarch64] <13>Apr 29 02:05:24 rpmi: flex-2.6.4.0.88.9801-alt1 sisyphus+275295.100.2.3 1624485321 installed
[aarch64] <13>Apr 29 02:05:24 rpmi: bc-1:1.07.1-alt1 sisyphus+278100.400.1.1 1626056633 installed
[aarch64] Building target platforms: aarch64
[aarch64] Building for target aarch64
[aarch64] Wrote: /usr/src/in/srpm/u-boot-repka4-2020.04.rc3.1-alt2.src.rpm (w7T24.xzdio)
[aarch64] Reading Package Lists...
[aarch64] Building Dependency Tree...
[aarch64] flex is already the newest version.
[aarch64] swig is already the newest version.
[aarch64] bc is already the newest version.
[aarch64] dtc is already the newest version.
[aarch64] python3-module-setuptools is already the newest version.
[aarch64] E: Couldn't find package gcc11
[aarch64] hsh-install: Failed to calculate package file list.
[aarch64] hsh-install: Failed to generate package file list.
2025-Apr-29 02:05:49 :: [aarch64] u-boot-repka4.git 2020.04.rc3.1-alt2: remote: cannot build src.rpm
2025-Apr-29 02:05:49 :: [aarch64] #100 u-boot-repka4.git 2020.04.rc3.1-alt2: build FAILED
2025-Apr-29 02:05:49 :: [aarch64] requesting cancellation of task processing
2025-Apr-29 02:05:50 :: [aarch64] build FAILED
2025-Apr-29 02:05:50 :: task #382791 for p10 FAILED
More information about the Sisyphus-incominger
mailing list