[#380397] [test-only] FAILED (try 2) rust.git=1.86.0-alt1
Girar awaiter (rauty)
girar-builder at altlinux.org
Sat Apr 5 19:57:40 MSK 2025
https://git.altlinux.org/tasks/380397/logs/events.2.1.log
https://packages.altlinux.org/tasks/380397
subtask name aarch64 i586 x86_64
#40 rust failed failed failed
2025-Apr-05 16:10:17 :: test-only task #380397 for sisyphus resumed by rauty:
#40 build 1.86.0-alt1 from /people/rauty/packages/rust.git fetched at 2025-Apr-05 16:07:50
#100 removed
2025-Apr-05 16:10:18 :: [x86_64] #40 rust.git 1.86.0-alt1: build start
2025-Apr-05 16:10:18 :: [aarch64] #40 rust.git 1.86.0-alt1: build start
2025-Apr-05 16:10:18 :: [i586] #40 rust.git 1.86.0-alt1: build start
[x86_64] raise RuntimeError(err)
[x86_64] RuntimeError: failed to run: /usr/src/RPM/BUILD/rust-1.86.0/build/bootstrap/debug/bootstrap install
2025-Apr-05 16:33:39 :: [x86_64] rust.git 1.86.0-alt1: remote: build failed
2025-Apr-05 16:33:39 :: [x86_64] #40 rust.git 1.86.0-alt1: build FAILED
2025-Apr-05 16:33:39 :: [x86_64] requesting cancellation of task processing
[i586] raise RuntimeError(err)
[i586] RuntimeError: failed to run: /usr/src/RPM/BUILD/rust-1.86.0/build/bootstrap/debug/bootstrap install
2025-Apr-05 16:39:49 :: [i586] rust.git 1.86.0-alt1: remote: build failed
2025-Apr-05 16:39:49 :: [i586] #40 rust.git 1.86.0-alt1: build FAILED
[aarch64] raise RuntimeError(err)
[aarch64] RuntimeError: failed to run: /usr/src/RPM/BUILD/rust-1.86.0/build/bootstrap/debug/bootstrap install
2025-Apr-05 16:57:39 :: [aarch64] rust.git 1.86.0-alt1: remote: build failed
2025-Apr-05 16:57:39 :: [aarch64] #40 rust.git 1.86.0-alt1: build FAILED
2025-Apr-05 16:33:40 :: [x86_64] build FAILED
2025-Apr-05 16:39:49 :: [i586] build FAILED
2025-Apr-05 16:57:40 :: [aarch64] build FAILED
2025-Apr-05 16:57:40 :: task #380397 for sisyphus FAILED
More information about the Sisyphus-incominger
mailing list