[#380427] [test-only] FAILED (try 7) libtdb.git=1.4.12-alt1 samba.git=4.21.4-alt1 sssd.git=2.9.6-alt3 ...
Girar awaiter (august)
girar-builder at altlinux.org
Sat Apr 5 01:11:27 MSK 2025
https://git.altlinux.org/tasks/380427/logs/events.7.1.log
https://packages.altlinux.org/tasks/380427
subtask name aarch64 i586 x86_64
#1000 sssd 14:25 10:42 9:53
#1100 libgkdi ? 37 36
#1200 libcng-dpapi ? 40 39
#1300 admc ? 2:54 2:43
#1400 freeipa ? ? failed
2025-Apr-04 21:55:49 :: test-only task #380427 for sisyphus resumed by august:
#100 build 1.4.12-alt1 from /people/august/packages/libtdb.git fetched at 2025-Apr-04 19:20:57
#200 removed
#300 removed
#400 removed
#500 build 4.21.4-alt1 from /people/august/packages/samba.git fetched at 2025-Apr-04 20:46:32
#600 removed
#700 removed
#1000 build 2.9.6-alt3 from /gears/s/sssd.git fetched at 2025-Apr-04 21:44:43
#1100 build 0.0.2-alt1 from /gears/l/libgkdi.git fetched at 2025-Apr-04 21:45:49
#1200 build 0.0.2-alt2 from /gears/l/libcng-dpapi.git fetched at 2025-Apr-04 21:46:42
#1300 build 0.20.0-alt1 from /gears/a/admc.git fetched at 2025-Apr-04 21:52:07
#1400 build 4.12.3-alt2 from /gears/f/freeipa.git fetched at 2025-Apr-04 21:55:34
2025-Apr-04 21:55:50 :: created build repo
2025-Apr-04 21:55:51 :: [aarch64] #100 libtdb.git 1.4.12-alt1: build start
2025-Apr-04 21:55:51 :: [i586] #100 libtdb.git 1.4.12-alt1: build start
2025-Apr-04 21:55:51 :: [x86_64] #100 libtdb.git 1.4.12-alt1: build start
2025-Apr-04 21:56:09 :: [i586] #100 libtdb.git 1.4.12-alt1: build OK (cached)
2025-Apr-04 21:56:09 :: [i586] #500 samba.git 4.21.4-alt1: build start
2025-Apr-04 21:56:10 :: [x86_64] #100 libtdb.git 1.4.12-alt1: build OK (cached)
2025-Apr-04 21:56:10 :: [x86_64] #500 samba.git 4.21.4-alt1: build start
2025-Apr-04 21:56:26 :: [aarch64] #100 libtdb.git 1.4.12-alt1: build OK (cached)
2025-Apr-04 21:56:26 :: [aarch64] #500 samba.git 4.21.4-alt1: build start
2025-Apr-04 21:56:28 :: [i586] #500 samba.git 4.21.4-alt1: build OK (cached)
2025-Apr-04 21:56:28 :: [i586] #1000 sssd.git 2.9.6-alt3: build start
2025-Apr-04 21:56:31 :: [x86_64] #500 samba.git 4.21.4-alt1: build OK (cached)
2025-Apr-04 21:56:31 :: [x86_64] #1000 sssd.git 2.9.6-alt3: build start
2025-Apr-04 21:57:01 :: [aarch64] #500 samba.git 4.21.4-alt1: build OK (cached)
2025-Apr-04 21:57:02 :: [aarch64] #1000 sssd.git 2.9.6-alt3: build start
2025-Apr-04 22:06:24 :: [x86_64] #1000 sssd.git 2.9.6-alt3: build OK
2025-Apr-04 22:06:25 :: [x86_64] #1100 libgkdi.git 0.0.2-alt1: build start
2025-Apr-04 22:07:01 :: [x86_64] #1100 libgkdi.git 0.0.2-alt1: build OK
2025-Apr-04 22:07:01 :: [x86_64] #1200 libcng-dpapi.git 0.0.2-alt2: build start
2025-Apr-04 22:07:10 :: [i586] #1000 sssd.git 2.9.6-alt3: build OK
2025-Apr-04 22:07:10 :: [i586] #1100 libgkdi.git 0.0.2-alt1: build start
2025-Apr-04 22:07:40 :: [x86_64] #1200 libcng-dpapi.git 0.0.2-alt2: build OK
2025-Apr-04 22:07:40 :: [x86_64] #1300 admc.git 0.20.0-alt1: build start
2025-Apr-04 22:07:47 :: [i586] #1100 libgkdi.git 0.0.2-alt1: build OK
2025-Apr-04 22:07:47 :: [i586] #1200 libcng-dpapi.git 0.0.2-alt2: build start
2025-Apr-04 22:08:27 :: [i586] #1200 libcng-dpapi.git 0.0.2-alt2: build OK
2025-Apr-04 22:08:27 :: [i586] #1300 admc.git 0.20.0-alt1: build start
2025-Apr-04 22:10:23 :: [x86_64] #1300 admc.git 0.20.0-alt1: build OK
2025-Apr-04 22:10:23 :: [x86_64] #1400 freeipa.git 4.12.3-alt2: build start
[x86_64] <13>Apr 4 22:10:37 rpmi: rpm-macros-webserver-common-1.4-alt1 sisyphus+277015.100.1.2 1625347616 installed
[x86_64] <13>Apr 4 22:10:37 rpmi: libmpdec3-2.5.1-alt3 sisyphus+314490.500.5.1 1675432004 installed
[x86_64] <13>Apr 4 22:10:37 rpmi: libgdbm-1.8.3-alt10 sisyphus+346222.200.3.2 1716468404 installed
[x86_64] <13>Apr 4 22:10:37 rpmi: libexpat-2.7.1-alt1 sisyphus+379929.100.1.1 1743519381 installed
[x86_64] <13>Apr 4 22:10:37 rpmi: openssl-config-3.2.0-alt1 sisyphus+366659.140.4.1 1736956949 installed
[x86_64] <13>Apr 4 22:10:37 rpmi: libb2-0.98.1-alt1_1 sisyphus+291614.100.1.1 1638962877 installed
[x86_64] <13>Apr 4 22:10:37 rpmi: libp11-kit-1:0.25.5-alt1 sisyphus+352553.100.1.1 1720622573 installed
[x86_64] <13>Apr 4 22:10:37 rpmi: libtasn1-4.20.0-alt2 sisyphus+375829.100.1.1 1740299335 installed
[x86_64] <13>Apr 4 22:10:37 rpmi: rpm-macros-alternatives-0.5.3-alt1 sisyphus+371878.100.1.1 1737988822 installed
[x86_64] <13>Apr 4 22:10:37 rpmi: alternatives-0.5.3-alt1 sisyphus+371878.100.1.1 1737988822 installed
[x86_64] <13>Apr 4 22:10:37 rpmi: ca-certificates-2025.02.10-alt1 sisyphus+374228.100.4.1 1739265441 installed
[x86_64] <13>Apr 4 22:10:37 rpmi: ca-trust-0.2.0-alt1 sisyphus+344843.100.1.1 1712743326 installed
[x86_64] <13>Apr 4 22:10:37 rpmi: p11-kit-trust-1:0.25.5-alt1 sisyphus+352553.100.1.1 1720622573 installed
[x86_64] <13>Apr 4 22:10:37 rpmi: libcrypto3-3.3.3-alt1 sisyphus+374381.40.2.1 1739299401 installed
[x86_64] <13>Apr 4 22:10:37 rpmi: libssl3-3.3.3-alt1 sisyphus+374381.40.2.1 1739299401 installed
[x86_64] <13>Apr 4 22:10:37 rpmi: python3-3.12.9-alt1 sisyphus+376344.100.1.1 1740741913 installed
[x86_64] <13>Apr 4 22:10:37 rpmi: python3-base-3.12.9-alt1 sisyphus+376344.100.1.1 1740741913 installed
[x86_64] <13>Apr 4 22:10:37 rpmi: python3-module-py3dephell-0.3.1-alt1 sisyphus+365261.200.1.1 1734463433 installed
[x86_64] <13>Apr 4 22:10:37 rpmi: tests-for-installed-python3-pkgs-0.1.28-alt1 sisyphus+375953.100.2.1 1740855713 installed
[x86_64] <13>Apr 4 22:10:37 rpmi: rpm-build-python3-0.1.28-alt1 sisyphus+375953.100.2.1 1740855713 installed
[x86_64] <13>Apr 4 22:10:37 rpmi: rpm-macros-apache2-3.14-alt1 sisyphus+322310.100.1.1 1685636944 installed
[x86_64] Reading Package Lists...
[x86_64] Building Dependency Tree...
[x86_64] MI2a: marked for install (shallow): libcmocka-devel
[x86_64] MI2a: satisfying Depends: libcmocka = 1.1.7-alt2:sisyphus+317359.140.9.2
[x86_64] MI2a: maybe install (a direct target): libcmocka 1.1.7-alt2:sisyphus+317359.140.9.2 at 1686174449
[x86_64] MI2a: target SELECTED: libcmocka 1.1.7-alt2:sisyphus+317359.140.9.2 at 1686174449
[x86_64] MI2a: requesting to install libcmocka (unspec'd ver; inspect with Debug::pkgMark-shallow)
[x86_64] MI2a: marked for install (shallow): libcmocka
[x86_64] MI2a: marked for install (shallow): libini_config-devel
[x86_64] MI2a: satisfying Depends: libini_config = 1.3.1-alt6:sisyphus+346133.200.2.1
[x86_64] MI2a: maybe install (a direct target): libini_config 1.3.1-alt6:sisyphus+346133.200.2.1 at 1716296158
[x86_64] MI2a: target SELECTED: libini_config 1.3.1-alt6:sisyphus+346133.200.2.1 at 1716296158
[x86_64] MI2a: requesting to install libini_config (unspec'd ver; inspect with Debug::pkgMark-shallow)
[x86_64] MI2a: marked for install (shallow): libini_config
[x86_64] MI2a: satisfying Depends: libpath_utils = 0.2.1-alt6:sisyphus+346133.200.2.1
[x86_64] MI2a: maybe install (a direct target): libpath_utils 0.2.1-alt6:sisyphus+346133.200.2.1 at 1716296158
[x86_64] MI2a: target SELECTED: libpath_utils 0.2.1-alt6:sisyphus+346133.200.2.1 at 1716296158
[x86_64] MI2a: requesting to install libpath_utils (unspec'd ver; inspect with Debug::pkgMark-shallow)
[x86_64] MI2a: marked for install (shallow): libpath_utils
[x86_64] MI2a: satisfying Depends: libcollection = 0.7.0-alt6:sisyphus+346133.200.2.1
[x86_64] MI2a: maybe install (a direct target): libcollection 0.7.0-alt6:sisyphus+346133.200.2.1 at 1716296158
[x86_64] MI2a: target SELECTED: libcollection 0.7.0-alt6:sisyphus+346133.200.2.1 at 1716296158
[x86_64] MI2a: requesting to install libcollection (unspec'd ver; inspect with Debug::pkgMark-shallow)
[x86_64] MI2a: marked for install (shallow): libcollection
[x86_64] MI2a: satisfying Depends: libref_array = 0.1.5-alt6:sisyphus+346133.200.2.1
[x86_64] MI2a: maybe install (a direct target): libref_array 0.1.5-alt6:sisyphus+346133.200.2.1 at 1716296158
[x86_64] MI2a: target SELECTED: libref_array 0.1.5-alt6:sisyphus+346133.200.2.1 at 1716296158
[x86_64] MI2a: requesting to install libref_array (unspec'd ver; inspect with Debug::pkgMark-shallow)
[x86_64] MI2a: marked for install (shallow): libref_array
[x86_64] MI2a: satisfying Depends: libbasicobjects = 0.1.1-alt6:sisyphus+346133.200.2.1
[x86_64] MI2a: maybe install (a direct target): libbasicobjects 0.1.1-alt6:sisyphus+346133.200.2.1 at 1716296158
[x86_64] MI2a: target SELECTED: libbasicobjects 0.1.1-alt6:sisyphus+346133.200.2.1 at 1716296158
[x86_64] MI2a: requesting to install libbasicobjects (unspec'd ver; inspect with Debug::pkgMark-shallow)
[x86_64] MI2a: marked for install (shallow): libbasicobjects
[x86_64] MI2a: satisfying Depends: libcollection-devel = 0.7.0-alt6:sisyphus+346133.200.2.1
[x86_64] MI2a: maybe install (a direct target): libcollection-devel 0.7.0-alt6:sisyphus+346133.200.2.1 at 1716296158
[x86_64] MI2a: target SELECTED: libcollection-devel 0.7.0-alt6:sisyphus+346133.200.2.1 at 1716296158
[x86_64] MI2a: requesting to install libcollection-devel (unspec'd ver; inspect with Debug::pkgMark-shallow)
[x86_64] MI2a: marked for install (shallow): libcollection-devel
[x86_64] MI2a: satisfying Depends: libref_array-devel = 0.1.5-alt6:sisyphus+346133.200.2.1
[x86_64] MI2a: maybe install (a direct target): libref_array-devel 0.1.5-alt6:sisyphus+346133.200.2.1 at 1716296158
[x86_64] MI2a: target SELECTED: libref_array-devel 0.1.5-alt6:sisyphus+346133.200.2.1 at 1716296158
[x86_64] MI2a: requesting to install libref_array-devel (unspec'd ver; inspect with Debug::pkgMark-shallow)
[x86_64] MI2a: marked for install (shallow): libref_array-devel
[x86_64] MI2a: satisfying Depends: libbasicobjects-devel = 0.1.1-alt6:sisyphus+346133.200.2.1
[x86_64] MI2a: maybe install (a direct target): libbasicobjects-devel 0.1.1-alt6:sisyphus+346133.200.2.1 at 1716296158
[x86_64] MI2a: target SELECTED: libbasicobjects-devel 0.1.1-alt6:sisyphus+346133.200.2.1 at 1716296158
[x86_64] MI2a: requesting to install libbasicobjects-devel (unspec'd ver; inspect with Debug::pkgMark-shallow)
[x86_64] MI2a: marked for install (shallow): libbasicobjects-devel
[x86_64] MI2a: marked for install (shallow): libkrb5-devel
[x86_64] MI2a: satisfying Depends: libcom_err-devel (NULL)
[x86_64] MI2a: maybe install (a direct target): libcom_err-devel 1.47.1.0.10.ad56-alt2:sisyphus+363497.200.3.1 at 1732729908
[x86_64] MI2a: target SELECTED: libcom_err-devel 1.47.1.0.10.ad56-alt2:sisyphus+363497.200.3.1 at 1732729908
[x86_64] MI2a: requesting to install libcom_err-devel (unspec'd ver; inspect with Debug::pkgMark-shallow)
[x86_64] MI2a: marked for install (shallow): libcom_err-devel
[x86_64] MI2a: satisfying Depends: libcom_err = 1.47.1.0.10.ad56-alt2:sisyphus+363497.200.3.1
[x86_64] MI2a: maybe install (a direct target): libcom_err 1.47.1.0.10.ad56-alt2:sisyphus+363497.200.3.1 at 1732729908
[x86_64] MI2a: target SELECTED: libcom_err 1.47.1.0.10.ad56-alt2:sisyphus+363497.200.3.1 at 1732729908
[x86_64] MI2a: requesting to install libcom_err (unspec'd ver; inspect with Debug::pkgMark-shallow)
[x86_64] MI2a: marked for install (shallow): libcom_err
[x86_64] MI2a: satisfying Depends: libverto-devel (NULL)
[x86_64] MI2a: maybe install (a direct target): libverto-devel 0.3.2-alt1_1:sisyphus+321176.2200.10.2 at 1684803947
[x86_64] MI2a: target SELECTED: libverto-devel 0.3.2-alt1_1:sisyphus+321176.2200.10.2 at 1684803947
[x86_64] MI2a: requesting to install libverto-devel (unspec'd ver; inspect with Debug::pkgMark-shallow)
[x86_64] MI2a: marked for install (shallow): libverto-devel
[x86_64] MI2a: satisfying Depends: libverto = 0.3.2-alt1_1:sisyphus+321176.2200.10.2
[x86_64] MI2a: maybe install (a direct target): libverto 0.3.2-alt1_1:sisyphus+321176.2200.10.2 at 1684803947
[x86_64] MI2a: target SELECTED: libverto 0.3.2-alt1_1:sisyphus+321176.2200.10.2 at 1684803947
[x86_64] MI2a: requesting to install libverto (unspec'd ver; inspect with Debug::pkgMark-shallow)
[x86_64] MI2a: marked for install (shallow): libverto
[x86_64] MI2a: satisfying Depends: libkrb5-ldap = 1.21.3-alt2:sisyphus+351857.100.1.1
[x86_64] MI2a: maybe install (a direct target): libkrb5-ldap 1.21.3-alt2:sisyphus+351857.100.1.1 at 1719735141
[x86_64] MI2a: target SELECTED: libkrb5-ldap 1.21.3-alt2:sisyphus+351857.100.1.1 at 1719735141
[x86_64] MI2a: requesting to install libkrb5-ldap (unspec'd ver; inspect with Debug::pkgMark-shallow)
[x86_64] MI2a: marked for install (shallow): libkrb5-ldap
[x86_64] MI2a: satisfying Depends: libldap.so.2()(64bit) >= set:nhw486imwDDwpeqD3wI6BatKuNiqYk3qY1xDcRSZHv0ImcQeMmHrjV5FSRXqh6A7QX4VS1T2hzdsLxxqTnCp7F1dyx2
[x86_64] MI2a: maybe install (a providing target): libldap2 2.6.9-alt2:sisyphus+367501.300.4.1 at 1735841751
[x86_64] MI2a: target SELECTED: libldap2 2.6.9-alt2:sisyphus+367501.300.4.1 at 1735841751
[x86_64] MI2a: requesting to install libldap2 (unspec'd ver; inspect with Debug::pkgMark-shallow)
[x86_64] MI2a: marked for install (shallow): libldap2
[x86_64] MI2a: satisfying Depends: libsasl2.so.3()(64bit) >= set:lhKAh7QjCM36Vnr6MdFxFf8LIcZsS1kl0wH7Iyp
[x86_64] MI2a: maybe install (a providing target): libsasl2-3 2.1.28-alt2.1:sisyphus+367419.100.1.1 at 1735482560
[x86_64] MI2a: target SELECTED: libsasl2-3 2.1.28-alt2.1:sisyphus+367419.100.1.1 at 1735482560
[x86_64] MI2a: requesting to install libsasl2-3 (unspec'd ver; inspect with Debug::pkgMark-shallow)
[x86_64] MI2a: marked for install (shallow): libsasl2-3
[x86_64] MI2a: satisfying Depends: libgssapi_krb5.so.2()(64bit) >= set:lf0DJ47AbmqBDH5NkLTAHJKEqtdvlqhNB6L2Rg0SUZ7tBjH8TxEF02bZ4pXhYpZGtjI4tGWbMZjIK9LCp2oNUgo
[x86_64] MI2a: maybe install (a providing target): libkrb5 1.21.3-alt2:sisyphus+351857.100.1.1 at 1719735141
[x86_64] MI2a: target SELECTED: libkrb5 1.21.3-alt2:sisyphus+351857.100.1.1 at 1719735141
[x86_64] MI2a: requesting to install libkrb5 (unspec'd ver; inspect with Debug::pkgMark-shallow)
[x86_64] MI2a: marked for install (shallow): libkrb5
[x86_64] MI2a: satisfying Depends: libkeyutils.so.1()(64bit) >= set:jfWn12U6KThBXgruPLZ68yYZt2
[x86_64] MI2a: maybe install (a providing target): libkeyutils 1.6.3-alt1:sisyphus+346336.200.2.2 at 1716472658
[x86_64] MI2a: target SELECTED: libkeyutils 1.6.3-alt1:sisyphus+346336.200.2.2 at 1716472658
[x86_64] MI2a: requesting to install libkeyutils (unspec'd ver; inspect with Debug::pkgMark-shallow)
[x86_64] MI2a: marked for install (shallow): libkeyutils
[x86_64] MI2a: satisfying Depends: liblmdb.so.0()(64bit) >= set:kfalKd4xYAkaAG2MqeH0wB2F4kTaBEo1iv0KFpxVmqzFIV6HJ0
[x86_64] MI2a: maybe install (a providing target): liblmdb 0.9.33-alt1:sisyphus+360625.100.1.1 at 1729819640
[x86_64] MI2a: target SELECTED: liblmdb 0.9.33-alt1:sisyphus+360625.100.1.1 at 1729819640
[x86_64] MI2a: requesting to install liblmdb (unspec'd ver; inspect with Debug::pkgMark-shallow)
[x86_64] MI2a: marked for install (shallow): liblmdb
[x86_64] MI2a: satisfying Depends: openldap-common = 2.6.9-alt2:sisyphus+367501.300.4.1
[x86_64] MI2a: maybe install (a direct target): openldap-common 2.6.9-alt2:sisyphus+367501.300.4.1 at 1735841751
[x86_64] MI2a: target SELECTED: openldap-common 2.6.9-alt2:sisyphus+367501.300.4.1 at 1735841751
[x86_64] MI2a: requesting to install openldap-common (unspec'd ver; inspect with Debug::pkgMark-shallow)
[x86_64] MI2a: marked for install (shallow): openldap-common
[x86_64] MI2a: marked for install (shallow): libsasl2-devel
[x86_64] MI2a: satisfying Depends: libssl-devel (NULL)
[x86_64] MI2a: maybe install (a direct target): libssl-devel 3.3.3-alt1:sisyphus+374381.40.2.1 at 1739299401
[x86_64] MI2a: target SELECTED: libssl-devel 3.3.3-alt1:sisyphus+374381.40.2.1 at 1739299401
[x86_64] MI2a: requesting to install libssl-devel (unspec'd ver; inspect with Debug::pkgMark-shallow)
[x86_64] MI2a: marked for install (shallow): libssl-devel
[x86_64] MI2a: marked for install (shallow): libsystemd-devel
[x86_64] MI2a: satisfying Depends: libsystemd = 1:255.18-alt1:sisyphus+378604.100.2.1
[x86_64] MI2a: maybe install (a direct target): libsystemd 1:255.18-alt1:sisyphus+378604.100.2.1 at 1742485242
[x86_64] MI2a: target SELECTED: libsystemd 1:255.18-alt1:sisyphus+378604.100.2.1 at 1742485242
[x86_64] MI2a: requesting to install libsystemd (unspec'd ver; inspect with Debug::pkgMark-shallow)
[x86_64] MI2a: marked for install (shallow): libsystemd
[x86_64] MI2a: satisfying Depends: liblz4.so.1()(64bit) >= set:kieS6pDVjX1
[x86_64] MI2a: maybe install (a providing target): liblz4 1:1.9.4-alt1:sisyphus+309416.100.1.1 at 1667412981
[x86_64] MI2a: target SELECTED: liblz4 1:1.9.4-alt1:sisyphus+309416.100.1.1 at 1667412981
[x86_64] MI2a: requesting to install liblz4 (unspec'd ver; inspect with Debug::pkgMark-shallow)
[x86_64] MI2a: marked for install (shallow): liblz4
[x86_64] MI2a: marked for install (shallow): libjansson-devel
[x86_64] MI2a: satisfying Depends: libjansson4 = 2.14.1-alt1:sisyphus+379832.100.1.1
[x86_64] MI2a: maybe install (a direct target): libjansson4 2.14.1-alt1:sisyphus+379832.100.1.1 at 1743438033
[x86_64] MI2a: target SELECTED: libjansson4 2.14.1-alt1:sisyphus+379832.100.1.1 at 1743438033
[x86_64] MI2a: requesting to install libjansson4 (unspec'd ver; inspect with Debug::pkgMark-shallow)
[x86_64] MI2a: marked for install (shallow): libjansson4
[x86_64] MI2a: marked for install (shallow): libcurl-devel
[x86_64] MI2a: satisfying Depends: bc (NULL)
[x86_64] MI2a: maybe install (a direct target): bc 1:1.07.1-alt1:sisyphus+346065.200.3.1 at 1716459102
[x86_64] MI2a: target SELECTED: bc 1:1.07.1-alt1:sisyphus+346065.200.3.1 at 1716459102
[x86_64] MI2a: requesting to install bc (unspec'd ver; inspect with Debug::pkgMark-shallow)
[x86_64] MI2a: marked for install (shallow): bc
[x86_64] MI2a: satisfying Depends: libcurl = 8.13.0-alt1:sisyphus+380015.100.1.1
[x86_64] MI2a: maybe install (a direct target): libcurl 8.13.0-alt1:sisyphus+380015.100.1.1 at 1743595100
[x86_64] MI2a: target SELECTED: libcurl 8.13.0-alt1:sisyphus+380015.100.1.1 at 1743595100
[x86_64] MI2a: requesting to install libcurl (unspec'd ver; inspect with Debug::pkgMark-shallow)
[x86_64] MI2a: marked for install (shallow): libcurl
[x86_64] MI2a: satisfying Depends: libbrotlidec.so.1()(64bit) >= set:heroOawuYbTK8
[x86_64] MI2a: maybe install (a providing target): libbrotlidec 1.1.0-alt1:sisyphus+328501.100.1.1 at 1693598419
[x86_64] MI2a: target SELECTED: libbrotlidec 1.1.0-alt1:sisyphus+328501.100.1.1 at 1693598419
[x86_64] MI2a: requesting to install libbrotlidec (unspec'd ver; inspect with Debug::pkgMark-shallow)
[x86_64] MI2a: marked for install (shallow): libbrotlidec
[x86_64] MI2a: satisfying Depends: libbrotlicommon = 1.1.0-alt1:sisyphus+328501.100.1.1
[x86_64] MI2a: maybe install (a direct target): libbrotlicommon 1.1.0-alt1:sisyphus+328501.100.1.1 at 1693598419
[x86_64] MI2a: target SELECTED: libbrotlicommon 1.1.0-alt1:sisyphus+328501.100.1.1 at 1693598419
[x86_64] MI2a: requesting to install libbrotlicommon (unspec'd ver; inspect with Debug::pkgMark-shallow)
[x86_64] MI2a: marked for install (shallow): libbrotlicommon
[x86_64] MI2a: satisfying Depends: libgnutls.so.30()(64bit) >= set:ohWzKsl3gEhunQQpmsYd9i7QCtiGyfZ1Iaw1tOFZbdeEKESximCRPnIehs3AEMQXZ0e8KN9yV59f8Zeu5QHTtKkulI9mjuLg9NIizyZhpZCsx8sGEZDBhhgZvpnajdZvocWora9BdPXEcA4Z2ghEYo7SHlnQVUueZmZ3mRKhNiuOM9tTy3ea4NtLvpeNEoJIEGZGt4EzRi7Gou7ejsSXA7k3B2O21
[x86_64] MI2a: maybe install (a providing target): libgnutls30 3.8.9-alt1:sisyphus+380042.200.2.1 at 1743618110
[x86_64] MI2a: target SELECTED: libgnutls30 3.8.9-alt1:sisyphus+380042.200.2.1 at 1743618110
[x86_64] MI2a: requesting to install libgnutls30 (unspec'd ver; inspect with Debug::pkgMark-shallow)
[x86_64] MI2a: marked for install (shallow): libgnutls30
[x86_64] MI2a: satisfying Depends: libhogweed.so.6()(64bit) >= set:mfnnj2ZgBdeg17M87tPneezLu1hRaAv7Mvee2P332bHTaZjeCozdeChKl8zpQyflmS6Vy6tRmgHXyW1dkybK4gSLUc4ZqST6Otwai2tAwz0231mJ0KXX1SRmE5Wv1xA3elkz1fS4ARIDtHglVAVYGsrdTpOlAk7oFZ51ji2BIsI0W6X7ePZg
[x86_64] MI2a: maybe install (a providing target): libhogweed6 3.10.1-alt1:sisyphus+372008.100.1.1 at 1738078259
[x86_64] MI2a: target SELECTED: libhogweed6 3.10.1-alt1:sisyphus+372008.100.1.1 at 1738078259
[x86_64] MI2a: requesting to install libhogweed6 (unspec'd ver; inspect with Debug::pkgMark-shallow)
[x86_64] MI2a: marked for install (shallow): libhogweed6
[x86_64] MI2a: satisfying Depends: libnettle8 = 3.10.1-alt1:sisyphus+372008.100.1.1
[x86_64] MI2a: maybe install (a direct target): libnettle8 3.10.1-alt1:sisyphus+372008.100.1.1 at 1738078259
[x86_64] MI2a: target SELECTED: libnettle8 3.10.1-alt1:sisyphus+372008.100.1.1 at 1738078259
[x86_64] MI2a: requesting to install libnettle8 (unspec'd ver; inspect with Debug::pkgMark-shallow)
[x86_64] MI2a: marked for install (shallow): libnettle8
[x86_64] MI2a: satisfying Depends: libidn2.so.0()(64bit) >= set:ifaFMURofX11
[x86_64] MI2a: maybe install (a providing target): libidn2 2.3.7-alt1:sisyphus+339505.100.1.2 at 1706718968
[x86_64] MI2a: target SELECTED: libidn2 2.3.7-alt1:sisyphus+339505.100.1.2 at 1706718968
[x86_64] MI2a: requesting to install libidn2 (unspec'd ver; inspect with Debug::pkgMark-shallow)
[x86_64] MI2a: marked for install (shallow): libidn2
[x86_64] MI2a: satisfying Depends: libgsasl.so.18()(64bit) >= set:jfNMMjxjlLiKUyEAZvcPMCX3
[x86_64] MI2a: maybe install (a providing target): libgsasl18 2.2.1-alt2:sisyphus+359713.200.2.1 at 1728905430
[x86_64] MI2a: target SELECTED: libgsasl18 2.2.1-alt2:sisyphus+359713.200.2.1 at 1728905430
[x86_64] MI2a: requesting to install libgsasl18 (unspec'd ver; inspect with Debug::pkgMark-shallow)
[x86_64] MI2a: marked for install (shallow): libgsasl18
[x86_64] MI2a: satisfying Depends: libidn.so.12()(64bit) >= set:kiBXars6
[x86_64] MI2a: maybe install (a providing target): libidn 1.37-alt2:sisyphus+300849.100.1.1 at 1653769687
[x86_64] MI2a: target SELECTED: libidn 1.37-alt2:sisyphus+300849.100.1.1 at 1653769687
[x86_64] MI2a: requesting to install libidn (unspec'd ver; inspect with Debug::pkgMark-shallow)
[x86_64] MI2a: marked for install (shallow): libidn
[x86_64] MI2a: satisfying Depends: libntlm.so.0()(64bit) >= set:hfknJM1
[x86_64] MI2a: maybe install (a providing target): libntlm 1.5-alt2:sisyphus+379810.500.4.1 at 1743501147
[x86_64] MI2a: target SELECTED: libntlm 1.5-alt2:sisyphus+379810.500.4.1 at 1743501147
[x86_64] MI2a: requesting to install libntlm (unspec'd ver; inspect with Debug::pkgMark-shallow)
[x86_64] MI2a: marked for install (shallow): libntlm
[x86_64] MI2a: satisfying Depends: libnghttp2.so.14()(64bit) >= set:lfKRgJ8UKsv8mdZbLF8OxWTLVASoUAdxTu6rssIpilYsUcqHL2CMZk6qphw90tGPaquCWnihEqT3x957koIkZCHIxV7ahJ9tEyXiPz1HGgyJf9XN1
[x86_64] MI2a: maybe install (a providing target): libnghttp2 1.65.0-alt1:sisyphus+377060.100.1.1 at 1741259309
[x86_64] MI2a: target SELECTED: libnghttp2 1.65.0-alt1:sisyphus+377060.100.1.1 at 1741259309
[x86_64] MI2a: requesting to install libnghttp2 (unspec'd ver; inspect with Debug::pkgMark-shallow)
[x86_64] MI2a: marked for install (shallow): libnghttp2
[x86_64] MI2a: satisfying Depends: libnghttp3.so.9()(64bit) >= set:kfOHsymuRovZfZIawj4STEmrF1Xh8iHADhCWQYMeA3u6CuDIW7ipo3
[x86_64] MI2a: maybe install (a providing target): libnghttp3.9 1.8.0-alt1:sisyphus+375942.100.1.1 at 1740420759
[x86_64] MI2a: target SELECTED: libnghttp3.9 1.8.0-alt1:sisyphus+375942.100.1.1 at 1740420759
[x86_64] MI2a: requesting to install libnghttp3.9 (unspec'd ver; inspect with Debug::pkgMark-shallow)
[x86_64] MI2a: marked for install (shallow): libnghttp3.9
[x86_64] MI2a: satisfying Depends: libngtcp2.so.16()(64bit) >= set:keggzSiMInQoBwKw3hOFjw6C4r5lyewzRrbvfiZqFvO6xZ2fVcSxD0qyPdhyUVRzsodbhSgNzKYVngELjUy4
[x86_64] MI2a: maybe install (a providing target): libngtcp2.16 1.11.0-alt2:sisyphus+376238.100.1.1 at 1740635087
[x86_64] MI2a: target SELECTED: libngtcp2.16 1.11.0-alt2:sisyphus+376238.100.1.1 at 1740635087
[x86_64] MI2a: requesting to install libngtcp2.16 (unspec'd ver; inspect with Debug::pkgMark-shallow)
[x86_64] MI2a: marked for install (shallow): libngtcp2.16
[x86_64] MI2a: satisfying Depends: libngtcp2_crypto_gnutls8 = 1.11.0-alt2:sisyphus+376238.100.1.1
[x86_64] MI2a: maybe install (a direct target): libngtcp2_crypto_gnutls8 1.11.0-alt2:sisyphus+376238.100.1.1 at 1740635087
[x86_64] MI2a: target SELECTED: libngtcp2_crypto_gnutls8 1.11.0-alt2:sisyphus+376238.100.1.1 at 1740635087
[x86_64] MI2a: requesting to install libngtcp2_crypto_gnutls8 (unspec'd ver; inspect with Debug::pkgMark-shallow)
[x86_64] MI2a: marked for install (shallow): libngtcp2_crypto_gnutls8
[x86_64] MI2a: satisfying Depends: libpsl.so.5()(64bit) >= set:ifo8sG4NYozTZj0
[x86_64] MI2a: maybe install (a providing target): libpsl 0.21.5-alt1:sisyphus+338474.100.1.1 at 1705684769
[x86_64] MI2a: target SELECTED: libpsl 0.21.5-alt1:sisyphus+338474.100.1.1 at 1705684769
[x86_64] MI2a: requesting to install libpsl (unspec'd ver; inspect with Debug::pkgMark-shallow)
[x86_64] MI2a: marked for install (shallow): libpsl
[x86_64] MI2a: satisfying Depends: publicsuffix-list-dafsa (NULL)
[x86_64] MI2a: maybe install (a direct target): publicsuffix-list-dafsa 20250131-alt1:sisyphus+373297.100.1.1 at 1738767834
[x86_64] MI2a: target SELECTED: publicsuffix-list-dafsa 20250131-alt1:sisyphus+373297.100.1.1 at 1738767834
[x86_64] MI2a: requesting to install publicsuffix-list-dafsa (unspec'd ver; inspect with Debug::pkgMark-shallow)
[x86_64] MI2a: marked for install (shallow): publicsuffix-list-dafsa
[x86_64] MI2a: satisfying Depends: libssh2.so.1()(64bit) >= set:lfFi2ZJdCZnNQqC7FxZHyYYVCMxI4j17rwEg278PVigoIDqIcaZ7xJLD99atVtQH9iZsC5Ell61tgIGFLCeeSh67CMC5lPNAQMZiC4sCFEZrVPrTUWqzcrzl40dFwHgO6KgVCvIKy5YGVlzlQbv1
[x86_64] MI2a: maybe install (a providing target): libssh2 1.11.0-alt2:sisyphus+339356.100.1.1 at 1706593137
[x86_64] MI2a: target SELECTED: libssh2 1.11.0-alt2:sisyphus+339356.100.1.1 at 1706593137
[x86_64] MI2a: requesting to install libssh2 (unspec'd ver; inspect with Debug::pkgMark-shallow)
[x86_64] MI2a: marked for install (shallow): libssh2
[x86_64] MI2a: marked for install (shallow): libsss_idmap-devel
[x86_64] MI2a: satisfying Depends: libsss_idmap = 2.9.6-alt3:sisyphus+380427.1000.7.1
[x86_64] MI2a: maybe install (a direct target): libsss_idmap 2.9.6-alt3:sisyphus+380427.1000.7.1 at 1743804358
[x86_64] MI2a: target SELECTED: libsss_idmap 2.9.6-alt3:sisyphus+380427.1000.7.1 at 1743804358
[x86_64] MI2a: requesting to install libsss_idmap (unspec'd ver; inspect with Debug::pkgMark-shallow)
[x86_64] MI2a: marked for install (shallow): libsss_idmap
[x86_64] MI2a: marked for install (shallow): libsss_certmap-devel
[x86_64] MI2a: satisfying Depends: libtalloc-devel (NULL)
[x86_64] MI2a: maybe install (a direct target): libtalloc-devel 1:2.4.2-alt1:sisyphus+342425.200.8.1 at 1714749074
[x86_64] MI2a: target SELECTED: libtalloc-devel 1:2.4.2-alt1:sisyphus+342425.200.8.1 at 1714749074
[x86_64] MI2a: requesting to install libtalloc-devel (unspec'd ver; inspect with Debug::pkgMark-shallow)
[x86_64] MI2a: marked for install (shallow): libtalloc-devel
[x86_64] MI2a: satisfying Depends: libtalloc = 1:2.4.2-alt1:sisyphus+342425.200.8.1
[x86_64] MI2a: maybe install (a direct target): libtalloc 1:2.4.2-alt1:sisyphus+342425.200.8.1 at 1714749074
[x86_64] MI2a: target SELECTED: libtalloc 1:2.4.2-alt1:sisyphus+342425.200.8.1 at 1714749074
[x86_64] MI2a: requesting to install libtalloc (unspec'd ver; inspect with Debug::pkgMark-shallow)
[x86_64] MI2a: marked for install (shallow): libtalloc
[x86_64] MI2a: satisfying Depends: libsss_certmap = 2.9.6-alt3:sisyphus+380427.1000.7.1
[x86_64] MI2a: maybe install (a direct target): libsss_certmap 2.9.6-alt3:sisyphus+380427.1000.7.1 at 1743804358
[x86_64] MI2a: target SELECTED: libsss_certmap 2.9.6-alt3:sisyphus+380427.1000.7.1 at 1743804358
[x86_64] MI2a: requesting to install libsss_certmap (unspec'd ver; inspect with Debug::pkgMark-shallow)
[x86_64] MI2a: marked for install (shallow): libsss_certmap
[x86_64] MI2a: marked for install (shallow): libsss_nss_idmap-devel
[x86_64] MI2a: satisfying Depends: libsss_nss_idmap = 2.9.6-alt3:sisyphus+380427.1000.7.1
[x86_64] MI2a: maybe install (a direct target): libsss_nss_idmap 2.9.6-alt3:sisyphus+380427.1000.7.1 at 1743804358
[x86_64] MI2a: target SELECTED: libsss_nss_idmap 2.9.6-alt3:sisyphus+380427.1000.7.1 at 1743804358
[x86_64] MI2a: requesting to install libsss_nss_idmap (unspec'd ver; inspect with Debug::pkgMark-shallow)
[x86_64] MI2a: marked for install (shallow): libsss_nss_idmap
[x86_64] MI2a: marked for install (shallow): 389-ds-base-devel
[x86_64] MI2a: satisfying Depends: libnspr-devel (NULL)
[x86_64] MI2a: maybe install (a direct target): libnspr-devel 1:4.35-alt1:sisyphus+308164.100.1.1 at 1665397040
[x86_64] MI2a: target SELECTED: libnspr-devel 1:4.35-alt1:sisyphus+308164.100.1.1 at 1665397040
[x86_64] MI2a: requesting to install libnspr-devel (unspec'd ver; inspect with Debug::pkgMark-shallow)
[x86_64] MI2a: marked for install (shallow): libnspr-devel
[x86_64] MI2a: satisfying Depends: libnspr = 1:4.35-alt1:sisyphus+308164.100.1.1
[x86_64] MI2a: maybe install (a direct target): libnspr 1:4.35-alt1:sisyphus+308164.100.1.1 at 1665397040
[x86_64] MI2a: target SELECTED: libnspr 1:4.35-alt1:sisyphus+308164.100.1.1 at 1665397040
[x86_64] MI2a: requesting to install libnspr (unspec'd ver; inspect with Debug::pkgMark-shallow)
[x86_64] MI2a: marked for install (shallow): libnspr
[x86_64] MI2a: satisfying Depends: libnss-devel (NULL)
[x86_64] MI2a: maybe install (a direct target): libnss-devel 3.109-alt1:sisyphus+376722.100.1.1 at 1741014134
[x86_64] MI2a: target SELECTED: libnss-devel 3.109-alt1:sisyphus+376722.100.1.1 at 1741014134
[x86_64] MI2a: requesting to install libnss-devel (unspec'd ver; inspect with Debug::pkgMark-shallow)
[x86_64] MI2a: marked for install (shallow): libnss-devel
[x86_64] MI2a: satisfying Depends: libnss = 3.109-alt1:sisyphus+376722.100.1.1
[x86_64] MI2a: maybe install (a direct target): libnss 3.109-alt1:sisyphus+376722.100.1.1 at 1741014134
[x86_64] MI2a: target SELECTED: libnss 3.109-alt1:sisyphus+376722.100.1.1 at 1741014134
[x86_64] MI2a: requesting to install libnss (unspec'd ver; inspect with Debug::pkgMark-shallow)
[x86_64] MI2a: marked for install (shallow): libnss
[x86_64] MI2a: satisfying Depends: libsqlite3.so.0()(64bit) >= set:oj4iEQrYGElEG3Qi7nSX7jmlCyi1MqmHyTZpQsiu67xh1g70mnoNYpLZ4YZz6
[x86_64] MI2a: maybe install (a providing target): libsqlite3 3.47.1-alt1:sisyphus+375553.2600.2.1 at 1740149712
[x86_64] MI2a: target SELECTED: libsqlite3 3.47.1-alt1:sisyphus+375553.2600.2.1 at 1740149712
[x86_64] MI2a: requesting to install libsqlite3 (unspec'd ver; inspect with Debug::pkgMark-shallow)
[x86_64] MI2a: marked for install (shallow): libsqlite3
[x86_64] MI2a: satisfying Depends: 389-ds-base = 3.1.2-alt2:sisyphus+373095.200.3.1
[x86_64] MI2a: maybe install (a direct target): 389-ds-base 3.1.2-alt2:sisyphus+373095.200.3.1 at 1738752682
[x86_64] MI2a: target SELECTED: 389-ds-base 3.1.2-alt2:sisyphus+373095.200.3.1 at 1738752682
[x86_64] MI2a: requesting to install 389-ds-base (unspec'd ver; inspect with Debug::pkgMark-shallow)
[x86_64] MI2a: marked for install (shallow): 389-ds-base
[x86_64] MI2a: satisfying Depends: libjemalloc2 (NULL)
[x86_64] MI2a: maybe install (a direct target): libjemalloc2 5.3.0-alt2:sisyphus+343949.100.1.1 at 1711729540
[x86_64] MI2a: target SELECTED: libjemalloc2 5.3.0-alt2:sisyphus+343949.100.1.1 at 1711729540
[x86_64] MI2a: requesting to install libjemalloc2 (unspec'd ver; inspect with Debug::pkgMark-shallow)
[x86_64] MI2a: marked for install (shallow): libjemalloc2
[x86_64] MI2a: satisfying Depends: cracklib-words (NULL)
[x86_64] MI2a: maybe install (a direct target): cracklib-words 1:2.10.3-alt1:sisyphus+366388.200.1.1 at 1735031301
[x86_64] MI2a: target SELECTED: cracklib-words 1:2.10.3-alt1:sisyphus+366388.200.1.1 at 1735031301
[x86_64] MI2a: requesting to install cracklib-words (unspec'd ver; inspect with Debug::pkgMark-shallow)
[x86_64] MI2a: marked for install (shallow): cracklib-words
[x86_64] MI2a: satisfying Depends: acl (NULL)
[x86_64] MI2a: maybe install (a direct target): acl 2.3.1.0.20.d265-alt1:sisyphus+346027.200.3.2 at 1716498315
[x86_64] MI2a: target SELECTED: acl 2.3.1.0.20.d265-alt1:sisyphus+346027.200.3.2 at 1716498315
[x86_64] MI2a: requesting to install acl (unspec'd ver; inspect with Debug::pkgMark-shallow)
[x86_64] MI2a: marked for install (shallow): acl
[x86_64] MI2a: satisfying Depends: libicui18n.so.74()(64bit) >= set:rollO3aXuRrpvirdd0
[x86_64] MI2a: maybe install (a providing target): libicu74 1:7.4.2-alt2:sisyphus+375553.3200.4.1 at 1740174502
[x86_64] MI2a: target SELECTED: libicu74 1:7.4.2-alt2:sisyphus+375553.3200.4.1 at 1740174502
[x86_64] MI2a: requesting to install libicu74 (unspec'd ver; inspect with Debug::pkgMark-shallow)
[x86_64] MI2a: marked for install (shallow): libicu74
[x86_64] MI2a: satisfying Depends: libnetsnmp.so.40()(64bit) >= set:okHg2QEe43GcH2aW4KhkGqmaBYAzEf2dMcxQJiUB6o0
[x86_64] MI2a: maybe install (a providing target): libnet-snmp40 5.9.4-alt1.1:sisyphus+366326.100.1.1 at 1734955875
[x86_64] MI2a: target SELECTED: libnet-snmp40 5.9.4-alt1.1:sisyphus+366326.100.1.1 at 1734955875
[x86_64] MI2a: requesting to install libnet-snmp40 (unspec'd ver; inspect with Debug::pkgMark-shallow)
[x86_64] MI2a: marked for install (shallow): libnet-snmp40
[x86_64] MI2a: satisfying Depends: libnetsnmpagent.so.40()(64bit) >= set:njkikEv6Zx7btPZBtow0TTfg3dBL51
[x86_64] MI2a: maybe install (a providing target): libnet-snmp40-agent 5.9.4-alt1.1:sisyphus+366326.100.1.1 at 1734955875
[x86_64] MI2a: target SELECTED: libnet-snmp40-agent 5.9.4-alt1.1:sisyphus+366326.100.1.1 at 1734955875
[x86_64] MI2a: requesting to install libnet-snmp40-agent (unspec'd ver; inspect with Debug::pkgMark-shallow)
[x86_64] MI2a: marked for install (shallow): libnet-snmp40-agent
[x86_64] MI2a: satisfying Depends: libmysqlclient.so.21()(64bit) >= set:lgoqpcCm5sUOa343kUxpnZtxge3GhMQysZo3mASxaWEPjqj18hs
[x86_64] MI2a: maybe install (a providing target): libmysqlclient21 8.0.41-alt1:sisyphus+372112.5200.37.1 at 1741283348
[x86_64] MI2a: target SELECTED: libmysqlclient21 8.0.41-alt1:sisyphus+372112.5200.37.1 at 1741283348
[x86_64] MI2a: requesting to install libmysqlclient21 (unspec'd ver; inspect with Debug::pkgMark-shallow)
[x86_64] MI2a: marked for install (shallow): libmysqlclient21
[x86_64] MI2a: satisfying Depends: libnl-3.so.200()(64bit) >= set:miL96Bisw4j1rr7PopGZy5TYwRolpRYkdTs8
[x86_64] MI2a: maybe install (a providing target): libnl3 3.11.0-alt1:sisyphus+363620.100.1.1 at 1732864957
[x86_64] MI2a: target SELECTED: libnl3 3.11.0-alt1:sisyphus+363620.100.1.1 at 1732864957
[x86_64] MI2a: requesting to install libnl3 (unspec'd ver; inspect with Debug::pkgMark-shallow)
[x86_64] MI2a: marked for install (shallow): libnl3
[x86_64] MI2a: satisfying Depends: libnl-common = 3.11.0-alt1:sisyphus+363620.100.1.1
[x86_64] MI2a: maybe install (a direct target): libnl-common 3.11.0-alt1:sisyphus+363620.100.1.1 at 1732864957
[x86_64] MI2a: target SELECTED: libnl-common 3.11.0-alt1:sisyphus+363620.100.1.1 at 1732864957
[x86_64] MI2a: requesting to install libnl-common (unspec'd ver; inspect with Debug::pkgMark-shallow)
[x86_64] MI2a: marked for install (shallow): libnl-common
[x86_64] MI2a: satisfying Depends: libsensors.so.5()(64bit) >= set:if6ejny3uZ1gaOco2d2
[x86_64] MI2a: maybe install (a providing target): libsensors3 3.6.0-alt4:sisyphus+366234.100.1.1 at 1734814779
[x86_64] MI2a: target SELECTED: libsensors3 3.6.0-alt4:sisyphus+366234.100.1.1 at 1734814779
[x86_64] MI2a: requesting to install libsensors3 (unspec'd ver; inspect with Debug::pkgMark-shallow)
[x86_64] MI2a: marked for install (shallow): libsensors3
[x86_64] MI2a: satisfying Depends: perl(Archive/Tar.pm) (NULL)
[x86_64] MI2a: maybe install (a providing target): perl-Archive-Tar 3.04-alt1:sisyphus+380140.100.1.1 at 1743708681
[x86_64] MI2a: target SELECTED: perl-Archive-Tar 3.04-alt1:sisyphus+380140.100.1.1 at 1743708681
[x86_64] MI2a: requesting to install perl-Archive-Tar (unspec'd ver; inspect with Debug::pkgMark-shallow)
[x86_64] MI2a: marked for install (shallow): perl-Archive-Tar
[x86_64] MI2a: satisfying Depends: perl(IO/Compress/Bzip2.pm) >= 2.015
[x86_64] MI2a: maybe install (a providing target): perl-IO-Compress 2.206-alt1:sisyphus+325819.100.1.1 at 1690563199
[x86_64] MI2a: target SELECTED: perl-IO-Compress 2.206-alt1:sisyphus+325819.100.1.1 at 1690563199
[x86_64] MI2a: requesting to install perl-IO-Compress (unspec'd ver; inspect with Debug::pkgMark-shallow)
[x86_64] MI2a: marked for install (shallow): perl-IO-Compress
[x86_64] MI2a: satisfying Depends: perl(Compress/Raw/Bzip2.pm) >= 2.206
[x86_64] MI2a: maybe install (a providing target): perl-Compress-Raw-Bzip2 2.213-alt1:sisyphus+380158.100.1.1 at 1743709764
[x86_64] MI2a: target SELECTED: perl-Compress-Raw-Bzip2 2.213-alt1:sisyphus+380158.100.1.1 at 1743709764
[x86_64] MI2a: requesting to install perl-Compress-Raw-Bzip2 (unspec'd ver; inspect with Debug::pkgMark-shallow)
[x86_64] MI2a: marked for install (shallow): perl-Compress-Raw-Bzip2
[x86_64] MI2a: satisfying Depends: perl(Compress/Raw/Zlib.pm) >= 2.206
[x86_64] MI2a: maybe install (a providing target): perl-Compress-Raw-Zlib 2.206-alt1:sisyphus+335067.600.1.1 at 1700901499
[x86_64] MI2a: target SELECTED: perl-Compress-Raw-Zlib 2.206-alt1:sisyphus+335067.600.1.1 at 1700901499
[x86_64] MI2a: requesting to install perl-Compress-Raw-Zlib (unspec'd ver; inspect with Debug::pkgMark-shallow)
[x86_64] MI2a: marked for install (shallow): perl-Compress-Raw-Zlib
[x86_64] MI2a: satisfying Depends: perl(Encode.pm) (NULL)
[x86_64] MI2a: maybe install (a providing target): perl-Encode 3.21-alt1:sisyphus+343095.100.1.1 at 1710875477
[x86_64] MI2a: target SELECTED: perl-Encode 3.21-alt1:sisyphus+343095.100.1.1 at 1710875477
[x86_64] MI2a: requesting to install perl-Encode (unspec'd ver; inspect with Debug::pkgMark-shallow)
[x86_64] MI2a: marked for install (shallow): perl-Encode
[x86_64] MI2a: satisfying Depends: perl(Filter/Util/Call.pm) (NULL)
[x86_64] MI2a: maybe install (a providing target): perl-Filter 1.64-alt1:sisyphus+335067.400.1.1 at 1700901412
[x86_64] MI2a: target SELECTED: perl-Filter 1.64-alt1:sisyphus+335067.400.1.1 at 1700901412
[x86_64] MI2a: requesting to install perl-Filter (unspec'd ver; inspect with Debug::pkgMark-shallow)
[x86_64] MI2a: marked for install (shallow): perl-Filter
[x86_64] MI2a: satisfying Depends: perl(IO/String.pm) (NULL)
[x86_64] MI2a: maybe install (a providing target): perl-IO-String 1.08-alt2 at 1321677915
[x86_64] MI2a: target SELECTED: perl-IO-String 1.08-alt2 at 1321677915
[x86_64] MI2a: requesting to install perl-IO-String (unspec'd ver; inspect with Debug::pkgMark-shallow)
[x86_64] MI2a: marked for install (shallow): perl-IO-String
[x86_64] MI2a: satisfying Depends: perl(IO/Zlib.pm) >= 1.010
[x86_64] MI2a: maybe install (a providing target): perl-IO-Zlib 1.15-alt1:sisyphus+343119.100.1.3 at 1710884191
[x86_64] MI2a: target SELECTED: perl-IO-Zlib 1.15-alt1:sisyphus+343119.100.1.3 at 1710884191
[x86_64] MI2a: requesting to install perl-IO-Zlib (unspec'd ver; inspect with Debug::pkgMark-shallow)
[x86_64] MI2a: marked for install (shallow): perl-IO-Zlib
[x86_64] MI2a: satisfying Depends: perl(Pod/Usage.pm) (NULL)
[x86_64] MI2a: maybe install (a providing target): perl-Pod-Usage 2.05-alt1:sisyphus+380280.100.1.2 at 1743749666
[x86_64] MI2a: target SELECTED: perl-Pod-Usage 2.05-alt1:sisyphus+380280.100.1.2 at 1743749666
[x86_64] MI2a: requesting to install perl-Pod-Usage (unspec'd ver; inspect with Debug::pkgMark-shallow)
[x86_64] MI2a: marked for install (shallow): perl-Pod-Usage
[x86_64] MI2a: satisfying Depends: perl-podlators (NULL)
[x86_64] MI2a: maybe install (a direct target): perl-podlators 6.0.2-alt1:sisyphus+380278.100.1.2 at 1743747710
[x86_64] MI2a: target SELECTED: perl-podlators 6.0.2-alt1:sisyphus+380278.100.1.2 at 1743747710
[x86_64] MI2a: requesting to install perl-podlators (unspec'd ver; inspect with Debug::pkgMark-shallow)
[x86_64] MI2a: marked for install (shallow): perl-podlators
[x86_64] MI2a: satisfying Depends: perl(Pod/Simple.pm) >= 3.260
[x86_64] MI2a: maybe install (a providing target): perl-Pod-Simple 3.45-alt1:sisyphus+321554.100.1.1 at 1684663135
[x86_64] MI2a: target SELECTED: perl-Pod-Simple 3.45-alt1:sisyphus+321554.100.1.1 at 1684663135
[x86_64] MI2a: requesting to install perl-Pod-Simple (unspec'd ver; inspect with Debug::pkgMark-shallow)
[x86_64] MI2a: marked for install (shallow): perl-Pod-Simple
[x86_64] MI2a: satisfying Depends: perl(Pod/Escapes.pm) >= 1.040
[x86_64] MI2a: maybe install (a providing target): perl-Pod-Escapes 1.07-alt1 at 1418767892
[x86_64] MI2a: target SELECTED: perl-Pod-Escapes 1.07-alt1 at 1418767892
[x86_64] MI2a: requesting to install perl-Pod-Escapes (unspec'd ver; inspect with Debug::pkgMark-shallow)
[x86_64] MI2a: marked for install (shallow): perl-Pod-Escapes
[x86_64] MI2a: satisfying Depends: perl(Term/ANSIColor.pm) (NULL)
[x86_64] MI2a: maybe install (a providing target): perl-Term-ANSIColor 5.01-alt1:sisyphus+244783.100.1.2 at 1579747505
[x86_64] MI2a: target SELECTED: perl-Term-ANSIColor 5.01-alt1:sisyphus+244783.100.1.2 at 1579747505
[x86_64] MI2a: requesting to install perl-Term-ANSIColor (unspec'd ver; inspect with Debug::pkgMark-shallow)
[x86_64] MI2a: marked for install (shallow): perl-Term-ANSIColor
[x86_64] MI2a: satisfying Depends: perl(Term/Cap.pm) (NULL)
[x86_64] MI2a: maybe install (a providing target): perl-Term-Cap 1.18-alt1:sisyphus+315126.100.1.1 at 1676227129
[x86_64] MI2a: target SELECTED: perl-Term-Cap 1.18-alt1:sisyphus+315126.100.1.1 at 1676227129
[x86_64] MI2a: requesting to install perl-Term-Cap (unspec'd ver; inspect with Debug::pkgMark-shallow)
[x86_64] MI2a: marked for install (shallow): perl-Term-Cap
[x86_64] MI2a: satisfying Depends: python3(magic) < 0
[x86_64] MI2a: maybe install (a providing target): python3-module-magic 0.4.27-alt1:sisyphus+303885.100.1.1 at 1658097371
[x86_64] MI2a: target SELECTED: python3-module-magic 0.4.27-alt1:sisyphus+303885.100.1.1 at 1658097371
[x86_64] MI2a: requesting to install python3-module-magic (unspec'd ver; inspect with Debug::pkgMark-shallow)
[x86_64] MI2a: marked for install (shallow): python3-module-magic
[x86_64] MI2a: satisfying PreDepends: /bin/systemctl (NULL)
[x86_64] MI2a: maybe install (a providing target): systemd 1:255.18-alt1:sisyphus+378604.100.2.1 at 1742485242
[x86_64] MI2a: target SELECTED: systemd 1:255.18-alt1:sisyphus+378604.100.2.1 at 1742485242
[x86_64] MI2a: requesting to install systemd (unspec'd ver; inspect with Debug::pkgMark-shallow)
[x86_64] MI2a: marked for install (shallow): systemd
[x86_64] MI2a: satisfying Depends: agetty (NULL)
[x86_64] MI2a: maybe install (a direct target): agetty 2.39.2-alt2:sisyphus+368471.140.2.1 at 1737124262
[x86_64] MI2a: target SELECTED: agetty 2.39.2-alt2:sisyphus+368471.140.2.1 at 1737124262
[x86_64] MI2a: requesting to install agetty (unspec'd ver; inspect with Debug::pkgMark-shallow)
[x86_64] MI2a: marked for install (shallow): agetty
[x86_64] MI2a: satisfying Depends: login (NULL)
[x86_64] MI2a: maybe install (a direct target): login 0.60-alt37:sisyphus+358299.200.3.1 at 1728461042
[x86_64] MI2a: target SELECTED: login 0.60-alt37:sisyphus+358299.200.3.1 at 1728461042
[x86_64] MI2a: requesting to install login (unspec'd ver; inspect with Debug::pkgMark-shallow)
[x86_64] MI2a: marked for install (shallow): login
[x86_64] MI2a: satisfying Depends: /sbin/sulogin (NULL)
[x86_64] MI2a: maybe install (a providing target): msulogin 1.0-alt1:sisyphus+278100.4500.1.1 at 1626059577
[x86_64] MI2a: target SELECTED: msulogin 1.0-alt1:sisyphus+278100.4500.1.1 at 1626059577
[x86_64] MI2a: requesting to install msulogin (unspec'd ver; inspect with Debug::pkgMark-shallow)
[x86_64] MI2a: marked for install (shallow): msulogin
[x86_64] MI2a: satisfying Depends: /bin/kmod (NULL)
[x86_64] MI2a: maybe install (a providing target): kmod 32-alt1:sisyphus+357452.100.2.1 at 1727718007
[x86_64] MI2a: target SELECTED: kmod 32-alt1:sisyphus+357452.100.2.1 at 1727718007
[x86_64] MI2a: requesting to install kmod (unspec'd ver; inspect with Debug::pkgMark-shallow)
[x86_64] MI2a: marked for install (shallow): kmod
[x86_64] MI2a: satisfying Depends: libkmod = 32-alt1:sisyphus+357452.100.2.1
[x86_64] MI2a: maybe install (a direct target): libkmod 32-alt1:sisyphus+357452.100.2.1 at 1727718007
[x86_64] MI2a: target SELECTED: libkmod 32-alt1:sisyphus+357452.100.2.1 at 1727718007
[x86_64] MI2a: requesting to install libkmod (unspec'd ver; inspect with Debug::pkgMark-shallow)
[x86_64] MI2a: marked for install (shallow): libkmod
[x86_64] MI2a: satisfying Depends: libcryptsetup.so.12()(64bit) >= set:lgsiOu0F84pKmDarpWUoLu2utpBgogxEQZ9GkclBSaWOon6Z8Qde1j0pWMzU04X5RUS4MMZhY7
[x86_64] MI2a: maybe install (a providing target): libcryptsetup 2.7.5-alt1:sisyphus+357554.100.1.1 at 1726319400
[x86_64] MI2a: target SELECTED: libcryptsetup 2.7.5-alt1:sisyphus+357554.100.1.1 at 1726319400
[x86_64] MI2a: requesting to install libcryptsetup (unspec'd ver; inspect with Debug::pkgMark-shallow)
[x86_64] MI2a: marked for install (shallow): libcryptsetup
[x86_64] MI2a: satisfying Depends: libargon2.so.1()(64bit) >= set:ihXI4
[x86_64] MI2a: maybe install (a providing target): libargon2 20190702-alt1:sisyphus+346050.200.2.1 at 1716230698
[x86_64] MI2a: target SELECTED: libargon2 20190702-alt1:sisyphus+346050.200.2.1 at 1716230698
[x86_64] MI2a: requesting to install libargon2 (unspec'd ver; inspect with Debug::pkgMark-shallow)
[x86_64] MI2a: marked for install (shallow): libargon2
[x86_64] MI2a: satisfying Depends: libdevmapper.so.1.02()(64bit) >= set:mgv0XV10qHIAn50cKWMKZzmU1pWkNnXVZ9fU9s04cF2Z8aZvX7VjJUTM8xykYEuVwAgUxG3BjMx04s9hUowJNDeQ9hpAl0KX2GE2
[x86_64] MI2a: maybe install (a providing target): libdevmapper 1.02.204-alt1:sisyphus+374689.200.1.1 at 1739555038
[x86_64] MI2a: target SELECTED: libdevmapper 1.02.204-alt1:sisyphus+374689.200.1.1 at 1739555038
[x86_64] MI2a: requesting to install libdevmapper (unspec'd ver; inspect with Debug::pkgMark-shallow)
[x86_64] MI2a: marked for install (shallow): libdevmapper
[x86_64] MI2a: satisfying Depends: libjson-c.so.5()(64bit) >= set:lgVUClxN6ARPmTWdxuumZzBigMoJuTwHlSeRntEsrjIbX7xSZCNSpk7OQyyliNI2vjLMMe0G8oaOG51
[x86_64] MI2a: maybe install (a providing target): libjson-c5 0.18-alt1:sisyphus+358387.100.1.1 at 1727298142
[x86_64] MI2a: target SELECTED: libjson-c5 0.18-alt1:sisyphus+358387.100.1.1 at 1727298142
[x86_64] MI2a: requesting to install libjson-c5 (unspec'd ver; inspect with Debug::pkgMark-shallow)
[x86_64] MI2a: marked for install (shallow): libjson-c5
[x86_64] MI2a: satisfying Depends: libfdisk.so.1()(64bit) >= set:mgb97D1N5Z1Hkjhpq7modG0EPRxVuIlPj4ZclEkCGe6kPuZwmR1t8jupoUuZBBPpiVZpyqHQh3EUgD2QCWu6EUCrg422ieg6jRJA3v905LKnKkCIfOZpZF6JHgfRallfC7E06NQj0tib2F2u1
[x86_64] MI2a: maybe install (a providing target): libfdisk 2.39.2-alt2:sisyphus+368471.140.2.1 at 1737124262
[x86_64] MI2a: target SELECTED: libfdisk 2.39.2-alt2:sisyphus+368471.140.2.1 at 1737124262
[x86_64] MI2a: requesting to install libfdisk (unspec'd ver; inspect with Debug::pkgMark-shallow)
[x86_64] MI2a: marked for install (shallow): libfdisk
[x86_64] MI2a: satisfying Depends: systemd-filesystem = 1:255.18-alt1:sisyphus+378604.100.2.1
[x86_64] MI2a: maybe install (a direct target): systemd-filesystem 1:255.18-alt1:sisyphus+378604.100.2.1 at 1742485242
[x86_64] MI2a: target SELECTED: systemd-filesystem 1:255.18-alt1:sisyphus+378604.100.2.1 at 1742485242
[x86_64] MI2a: requesting to install systemd-filesystem (unspec'd ver; inspect with Debug::pkgMark-shallow)
[x86_64] MI2a: marked for install (shallow): systemd-filesystem
[x86_64] MI2a: satisfying Depends: libnss-systemd = 1:255.18-alt1:sisyphus+378604.100.2.1
[x86_64] MI2a: maybe install (a direct target): libnss-systemd 1:255.18-alt1:sisyphus+378604.100.2.1 at 1742485242
[x86_64] MI2a: target SELECTED: libnss-systemd 1:255.18-alt1:sisyphus+378604.100.2.1 at 1742485242
[x86_64] MI2a: requesting to install libnss-systemd (unspec'd ver; inspect with Debug::pkgMark-shallow)
[x86_64] MI2a: marked for install (shallow): libnss-systemd
[x86_64] MI2a: satisfying Depends: libnss-myhostname = 1:255.18-alt1:sisyphus+378604.100.2.1
[x86_64] MI2a: maybe install (a direct target): libnss-myhostname 1:255.18-alt1:sisyphus+378604.100.2.1 at 1742485242
[x86_64] MI2a: target SELECTED: libnss-myhostname 1:255.18-alt1:sisyphus+378604.100.2.1 at 1742485242
[x86_64] MI2a: requesting to install libnss-myhostname (unspec'd ver; inspect with Debug::pkgMark-shallow)
[x86_64] MI2a: marked for install (shallow): libnss-myhostname
[x86_64] MI2a: satisfying PreDepends: chrooted >= 0.3.5-alt1
[x86_64] MI2a: maybe install (a direct target): chrooted 0.3.12-alt1:sisyphus+327286.5300.14.1 at 1711487147
[x86_64] MI2a: target SELECTED: chrooted 0.3.12-alt1:sisyphus+327286.5300.14.1 at 1711487147
[x86_64] MI2a: requesting to install chrooted (unspec'd ver; inspect with Debug::pkgMark-shallow)
[x86_64] MI2a: marked for install (shallow): chrooted
[x86_64] MI2a: satisfying Depends: pam_systemd = 1:255.18-alt1:sisyphus+378604.100.2.1
[x86_64] MI2a: maybe install (a direct target): pam_systemd 1:255.18-alt1:sisyphus+378604.100.2.1 at 1742485242
[x86_64] MI2a: target SELECTED: pam_systemd 1:255.18-alt1:sisyphus+378604.100.2.1 at 1742485242
[x86_64] MI2a: requesting to install pam_systemd (unspec'd ver; inspect with Debug::pkgMark-shallow)
[x86_64] MI2a: marked for install (shallow): pam_systemd
[x86_64] MI2a: satisfying Depends: dbus >= 1.11.0
[x86_64] MI2a: maybe install (a direct target): dbus 1.16.2-alt1:sisyphus+376383.100.1.1 at 1740749230
[x86_64] MI2a: target SELECTED: dbus 1.16.2-alt1:sisyphus+376383.100.1.1 at 1740749230
[x86_64] MI2a: requesting to install dbus (unspec'd ver; inspect with Debug::pkgMark-shallow)
[x86_64] MI2a: marked for install (shallow): dbus
[x86_64] MI2a: satisfying Depends: dbus-tools = 1.16.2-alt1:sisyphus+376383.100.1.1
[x86_64] MI2a: maybe install (a direct target): dbus-tools 1.16.2-alt1:sisyphus+376383.100.1.1 at 1740749230
[x86_64] MI2a: target SELECTED: dbus-tools 1.16.2-alt1:sisyphus+376383.100.1.1 at 1740749230
[x86_64] MI2a: requesting to install dbus-tools (unspec'd ver; inspect with Debug::pkgMark-shallow)
[x86_64] MI2a: marked for install (shallow): dbus-tools
[x86_64] MI2a: satisfying Depends: libdbus = 1.16.2-alt1:sisyphus+376383.100.1.1
[x86_64] MI2a: maybe install (a direct target): libdbus 1.16.2-alt1:sisyphus+376383.100.1.1 at 1740749230
[x86_64] MI2a: target SELECTED: libdbus 1.16.2-alt1:sisyphus+376383.100.1.1 at 1740749230
[x86_64] MI2a: requesting to install libdbus (unspec'd ver; inspect with Debug::pkgMark-shallow)
[x86_64] MI2a: marked for install (shallow): libdbus
[x86_64] MI2a: satisfying Depends: systemd-boot-efi = 1:255.18-alt1:sisyphus+378604.100.2.1
[x86_64] MI2a: maybe install (a direct target): systemd-boot-efi 1:255.18-alt1:sisyphus+378604.100.2.1 at 1742485242
[x86_64] MI2a: target SELECTED: systemd-boot-efi 1:255.18-alt1:sisyphus+378604.100.2.1 at 1742485242
[x86_64] MI2a: requesting to install systemd-boot-efi (unspec'd ver; inspect with Debug::pkgMark-shallow)
[x86_64] MI2a: marked for install (shallow): systemd-boot-efi
[x86_64] MI2a: satisfying Depends: systemd-utils-filetriggers = 1:255.18-alt1:sisyphus+378604.100.2.1
[x86_64] MI2a: maybe install (a direct target): systemd-utils-filetriggers 1:255.18-alt1:sisyphus+378604.100.2.1 at 1742485242
[x86_64] MI2a: target SELECTED: systemd-utils-filetriggers 1:255.18-alt1:sisyphus+378604.100.2.1 at 1742485242
[x86_64] MI2a: requesting to install systemd-utils-filetriggers (unspec'd ver; inspect with Debug::pkgMark-shallow)
[x86_64] MI2a: marked for install (shallow): systemd-utils-filetriggers
[x86_64] MI2a: satisfying Depends: systemd-tmpfiles-common = 1:255.18-alt1:sisyphus+378604.100.2.1
[x86_64] MI2a: maybe install (a direct target): systemd-tmpfiles-common 1:255.18-alt1:sisyphus+378604.100.2.1 at 1742485242
[x86_64] MI2a: target SELECTED: systemd-tmpfiles-common 1:255.18-alt1:sisyphus+378604.100.2.1 at 1742485242
[x86_64] MI2a: requesting to install systemd-tmpfiles-common (unspec'd ver; inspect with Debug::pkgMark-shallow)
[x86_64] MI2a: marked for install (shallow): systemd-tmpfiles-common
[x86_64] MI2a: satisfying Depends: systemd-sysctl-common = 1:255.18-alt1:sisyphus+378604.100.2.1
[x86_64] MI2a: maybe install (a direct target): systemd-sysctl-common 1:255.18-alt1:sisyphus+378604.100.2.1 at 1742485242
[x86_64] MI2a: target SELECTED: systemd-sysctl-common 1:255.18-alt1:sisyphus+378604.100.2.1 at 1742485242
[x86_64] MI2a: requesting to install systemd-sysctl-common (unspec'd ver; inspect with Debug::pkgMark-shallow)
[x86_64] MI2a: marked for install (shallow): systemd-sysctl-common
[x86_64] MI2a: satisfying Depends: systemd-modules-common = 1:255.18-alt1:sisyphus+378604.100.2.1
[x86_64] MI2a: maybe install (a direct target): systemd-modules-common 1:255.18-alt1:sisyphus+378604.100.2.1 at 1742485242
[x86_64] MI2a: target SELECTED: systemd-modules-common 1:255.18-alt1:sisyphus+378604.100.2.1 at 1742485242
[x86_64] MI2a: requesting to install systemd-modules-common (unspec'd ver; inspect with Debug::pkgMark-shallow)
[x86_64] MI2a: marked for install (shallow): systemd-modules-common
[x86_64] MI2a: satisfying Depends: udev = 1:255.18-alt1:sisyphus+378604.100.2.1
[x86_64] MI2a: maybe install (a direct target): udev 1:255.18-alt1:sisyphus+378604.100.2.1 at 1742485242
[x86_64] MI2a: target SELECTED: udev 1:255.18-alt1:sisyphus+378604.100.2.1 at 1742485242
[x86_64] MI2a: requesting to install udev (unspec'd ver; inspect with Debug::pkgMark-shallow)
[x86_64] MI2a: marked for install (shallow): udev
[x86_64] MI2a: satisfying Depends: dmsetup (NULL)
[x86_64] MI2a: maybe install (a direct target): dmsetup 1.02.204-alt1:sisyphus+374689.200.1.1 at 1739555038
[x86_64] MI2a: target SELECTED: dmsetup 1.02.204-alt1:sisyphus+374689.200.1.1 at 1739555038
[x86_64] MI2a: requesting to install dmsetup (unspec'd ver; inspect with Debug::pkgMark-shallow)
[x86_64] MI2a: marked for install (shallow): dmsetup
[x86_64] MI2a: satisfying Depends: lsblk (NULL)
[x86_64] MI2a: maybe install (a direct target): lsblk 2.39.2-alt2:sisyphus+368471.140.2.1 at 1737124262
[x86_64] MI2a: target SELECTED: lsblk 2.39.2-alt2:sisyphus+368471.140.2.1 at 1737124262
[x86_64] MI2a: requesting to install lsblk (unspec'd ver; inspect with Debug::pkgMark-shallow)
[x86_64] MI2a: marked for install (shallow): lsblk
[x86_64] MI2a: satisfying Depends: losetup >= 2.19.1
[x86_64] MI2a: maybe install (a direct target): losetup 2.39.2-alt2:sisyphus+368471.140.2.1 at 1737124262
[x86_64] MI2a: target SELECTED: losetup 2.39.2-alt2:sisyphus+368471.140.2.1 at 1737124262
[x86_64] MI2a: requesting to install losetup (unspec'd ver; inspect with Debug::pkgMark-shallow)
[x86_64] MI2a: marked for install (shallow): losetup
[x86_64] MI2a: satisfying Depends: mount (NULL)
[x86_64] MI2a: maybe install (a direct target): mount 2.39.2-alt2:sisyphus+368471.140.2.1 at 1737124262
[x86_64] MI2a: target SELECTED: mount 2.39.2-alt2:sisyphus+368471.140.2.1 at 1737124262
[x86_64] MI2a: requesting to install mount (unspec'd ver; inspect with Debug::pkgMark-shallow)
[x86_64] MI2a: marked for install (shallow): mount
[x86_64] MI2a: satisfying Depends: 389-ds-base-libs = 3.1.2-alt2:sisyphus+373095.200.3.1
[x86_64] MI2a: maybe install (a direct target): 389-ds-base-libs 3.1.2-alt2:sisyphus+373095.200.3.1 at 1738752682
[x86_64] MI2a: target SELECTED: 389-ds-base-libs 3.1.2-alt2:sisyphus+373095.200.3.1 at 1738752682
[x86_64] MI2a: requesting to install 389-ds-base-libs (unspec'd ver; inspect with Debug::pkgMark-shallow)
[x86_64] MI2a: marked for install (shallow): 389-ds-base-libs
[x86_64] MI2a: satisfying Depends: libcrack.so.2()(64bit) >= set:ihSG5
[x86_64] MI2a: maybe install (a providing target): cracklib 2.10.3-alt1:sisyphus+366388.100.1.1 at 1735031279
[x86_64] MI2a: target SELECTED: cracklib 2.10.3-alt1:sisyphus+366388.100.1.1 at 1735031279
[x86_64] MI2a: requesting to install cracklib (unspec'd ver; inspect with Debug::pkgMark-shallow)
[x86_64] MI2a: marked for install (shallow): cracklib
[x86_64] MI2a: satisfying Depends: cracklib-utils = 2.10.3-alt1:sisyphus+366388.100.1.1
[x86_64] MI2a: maybe install (a direct target): cracklib-utils 2.10.3-alt1:sisyphus+366388.100.1.1 at 1735031279
[x86_64] MI2a: target SELECTED: cracklib-utils 2.10.3-alt1:sisyphus+366388.100.1.1 at 1735031279
[x86_64] MI2a: requesting to install cracklib-utils (unspec'd ver; inspect with Debug::pkgMark-shallow)
[x86_64] MI2a: marked for install (shallow): cracklib-utils
[x86_64] MI2a: satisfying Depends: python3-module-lib389 = 3.1.2-alt2:sisyphus+373095.200.3.1
[x86_64] MI2a: maybe install (a direct target): python3-module-lib389 3.1.2-alt2:sisyphus+373095.200.3.1 at 1738752682
[x86_64] MI2a: target SELECTED: python3-module-lib389 3.1.2-alt2:sisyphus+373095.200.3.1 at 1738752682
[x86_64] MI2a: requesting to install python3-module-lib389 (unspec'd ver; inspect with Debug::pkgMark-shallow)
[x86_64] MI2a: marked for install (shallow): python3-module-lib389
[x86_64] MI2a: satisfying Depends: nss-utils (NULL)
[x86_64] MI2a: maybe install (a direct target): nss-utils 3.109-alt1:sisyphus+376722.100.1.1 at 1741014134
[x86_64] MI2a: target SELECTED: nss-utils 3.109-alt1:sisyphus+376722.100.1.1 at 1741014134
[x86_64] MI2a: requesting to install nss-utils (unspec'd ver; inspect with Debug::pkgMark-shallow)
[x86_64] MI2a: marked for install (shallow): nss-utils
[x86_64] MI2a: satisfying Depends: python3(argcomplete) < 0
[x86_64] MI2a: maybe install (a providing target): python3-module-argcomplete 3.6.2-alt1:sisyphus+380100.100.1.1 at 1743688705
[x86_64] MI2a: target SELECTED: python3-module-argcomplete 3.6.2-alt1:sisyphus+380100.100.1.1 at 1743688705
[x86_64] MI2a: requesting to install python3-module-argcomplete (unspec'd ver; inspect with Debug::pkgMark-shallow)
[x86_64] MI2a: marked for install (shallow): python3-module-argcomplete
[x86_64] MI2a: satisfying Depends: python3(cryptography) < 0
[x86_64] MI2a: maybe install (a providing target): python3-module-cryptography 44.0.0-alt1:sisyphus+368451.100.1.1 at 1736436050
[x86_64] MI2a: target SELECTED: python3-module-cryptography 44.0.0-alt1:sisyphus+368451.100.1.1 at 1736436050
[x86_64] MI2a: requesting to install python3-module-cryptography (unspec'd ver; inspect with Debug::pkgMark-shallow)
[x86_64] MI2a: marked for install (shallow): python3-module-cryptography
[x86_64] MI2a: satisfying Depends: python3(cffi) < 0
[x86_64] MI2a: maybe install (a providing target): python3-module-cffi 1.17.1-alt1:sisyphus+357396.100.1.1 at 1726156476
[x86_64] MI2a: target SELECTED: python3-module-cffi 1.17.1-alt1:sisyphus+357396.100.1.1 at 1726156476
[x86_64] MI2a: requesting to install python3-module-cffi (unspec'd ver; inspect with Debug::pkgMark-shallow)
[x86_64] MI2a: marked for install (shallow): python3-module-cffi
[x86_64] MI2a: satisfying Depends: python3-module-pycparser (NULL)
[x86_64] MI2a: maybe install (a direct target): python3-module-pycparser 2.22-alt1:sisyphus+378485.100.1.1 at 1742331206
[x86_64] MI2a: target SELECTED: python3-module-pycparser 2.22-alt1:sisyphus+378485.100.1.1 at 1742331206
[x86_64] MI2a: requesting to install python3-module-pycparser (unspec'd ver; inspect with Debug::pkgMark-shallow)
[x86_64] MI2a: marked for install (shallow): python3-module-pycparser
[x86_64] MI2a: satisfying Depends: python3(dateutil.parser) < 0
[x86_64] MI2a: maybe install (a providing target): python3-module-dateutil 2.9.0.post0-alt1:sisyphus+378451.100.1.1 at 1742313746
[x86_64] MI2a: target SELECTED: python3-module-dateutil 2.9.0.post0-alt1:sisyphus+378451.100.1.1 at 1742313746
[x86_64] MI2a: requesting to install python3-module-dateutil (unspec'd ver; inspect with Debug::pkgMark-shallow)
[x86_64] MI2a: marked for install (shallow): python3-module-dateutil
[x86_64] MI2a: satisfying Depends: python3(six) < 0
[x86_64] MI2a: maybe install (a providing target): python3-module-six 1.17.0-alt1.1:sisyphus+373470.100.1.1 at 1738920023
[x86_64] MI2a: target SELECTED: python3-module-six 1.17.0-alt1.1:sisyphus+373470.100.1.1 at 1738920023
[x86_64] MI2a: requesting to install python3-module-six (unspec'd ver; inspect with Debug::pkgMark-shallow)
[x86_64] MI2a: marked for install (shallow): python3-module-six
[x86_64] MI2a: satisfying Depends: python3(distro) < 0
[x86_64] MI2a: maybe install (a providing target): python3-module-distro 1.8.0-alt1:sisyphus+315544.100.1.1 at 1676899811
[x86_64] MI2a: target SELECTED: python3-module-distro 1.8.0-alt1:sisyphus+315544.100.1.1 at 1676899811
[x86_64] MI2a: requesting to install python3-module-distro (unspec'd ver; inspect with Debug::pkgMark-shallow)
[x86_64] MI2a: marked for install (shallow): python3-module-distro
[x86_64] MI2a: satisfying Depends: python3(ldap) < 0
[x86_64] MI2a: maybe install (a providing target): python3-module-ldap 3.4.4-alt1:sisyphus+333513.67500.74.1 at 1704721072
[x86_64] MI2a: target SELECTED: python3-module-ldap 3.4.4-alt1:sisyphus+333513.67500.74.1 at 1704721072
[x86_64] MI2a: requesting to install python3-module-ldap (unspec'd ver; inspect with Debug::pkgMark-shallow)
[x86_64] MI2a: marked for install (shallow): python3-module-ldap
[x86_64] MI2a: satisfying Depends: python3-module-pyasn1 (NULL)
[x86_64] MI2a: maybe install (a direct target): python3-module-pyasn1 0.6.1-alt1:sisyphus+357301.100.1.1 at 1740397762
[x86_64] MI2a: target SELECTED: python3-module-pyasn1 0.6.1-alt1:sisyphus+357301.100.1.1 at 1740397762
[x86_64] MI2a: requesting to install python3-module-pyasn1 (unspec'd ver; inspect with Debug::pkgMark-shallow)
[x86_64] MI2a: marked for install (shallow): python3-module-pyasn1
[x86_64] MI2a: satisfying Depends: python3-module-pyasn1-modules (NULL)
[x86_64] MI2a: maybe install (a direct target): python3-module-pyasn1-modules 0.4.2-alt1:sisyphus+379464.100.1.1 at 1743152074
[x86_64] MI2a: target SELECTED: python3-module-pyasn1-modules 0.4.2-alt1:sisyphus+379464.100.1.1 at 1743152074
[x86_64] MI2a: requesting to install python3-module-pyasn1-modules (unspec'd ver; inspect with Debug::pkgMark-shallow)
[x86_64] MI2a: marked for install (shallow): python3-module-pyasn1-modules
[x86_64] MI2a: satisfying Depends: openssl (NULL)
[x86_64] MI2a: maybe install (a direct target): openssl 3.3.3-alt1:sisyphus+374381.40.2.1 at 1739299401
[x86_64] MI2a: target SELECTED: openssl 3.3.3-alt1:sisyphus+374381.40.2.1 at 1739299401
[x86_64] MI2a: requesting to install openssl (unspec'd ver; inspect with Debug::pkgMark-shallow)
[x86_64] MI2a: marked for install (shallow): openssl
[x86_64] MI2a: marked for install (shallow): samba-devel
[x86_64] MI2a: satisfying Depends: libtevent-devel (NULL)
[x86_64] MI2a: maybe install (a direct target): libtevent-devel 0.16.1-alt1:sisyphus+342425.400.8.1 at 1714749143
[x86_64] MI2a: target SELECTED: libtevent-devel 0.16.1-alt1:sisyphus+342425.400.8.1 at 1714749143
[x86_64] MI2a: requesting to install libtevent-devel (unspec'd ver; inspect with Debug::pkgMark-shallow)
[x86_64] MI2a: marked for install (shallow): libtevent-devel
[x86_64] MI2a: satisfying Depends: libtevent = 0.16.1-alt1:sisyphus+342425.400.8.1
[x86_64] MI2a: maybe install (a direct target): libtevent 0.16.1-alt1:sisyphus+342425.400.8.1 at 1714749143
[x86_64] MI2a: target SELECTED: libtevent 0.16.1-alt1:sisyphus+342425.400.8.1 at 1714749143
[x86_64] MI2a: requesting to install libtevent (unspec'd ver; inspect with Debug::pkgMark-shallow)
[x86_64] MI2a: marked for install (shallow): libtevent
[x86_64] MI2a: satisfying Depends: samba-dc-libs = 4.21.4-alt1:sisyphus+380427.500.4.1
[x86_64] MI2a: maybe install (a direct target): samba-dc-libs 4.21.4-alt1:sisyphus+380427.500.4.1 at 1743800937
[x86_64] MI2a: target SELECTED: samba-dc-libs 4.21.4-alt1:sisyphus+380427.500.4.1 at 1743800937
[x86_64] MI2a: requesting to install samba-dc-libs (unspec'd ver; inspect with Debug::pkgMark-shallow)
[x86_64] MI2a: marked for install (shallow): samba-dc-libs
[x86_64] MI2a: satisfying Depends: libgpgme.so.11()(64bit) >= set:lhVJlpVwlEEix3xQ4fGGVr9ZLAZq6Zy1ZL7VZl
[x86_64] MI2a: maybe install (a providing target): libgpgme11 1.24.1-alt1:sisyphus+365199.100.1.1 at 1734364569
[x86_64] MI2a: target SELECTED: libgpgme11 1.24.1-alt1:sisyphus+365199.100.1.1 at 1734364569
[x86_64] MI2a: requesting to install libgpgme11 (unspec'd ver; inspect with Debug::pkgMark-shallow)
[x86_64] MI2a: marked for install (shallow): libgpgme11
[x86_64] MI2a: satisfying Depends: gpgme-common >= 1.24.1-alt1
[x86_64] MI2a: maybe install (a direct target): gpgme-common 1.24.1-alt1:sisyphus+365199.100.1.1 at 1734364569
[x86_64] MI2a: target SELECTED: gpgme-common 1.24.1-alt1:sisyphus+365199.100.1.1 at 1734364569
[x86_64] MI2a: requesting to install gpgme-common (unspec'd ver; inspect with Debug::pkgMark-shallow)
[x86_64] MI2a: marked for install (shallow): gpgme-common
[x86_64] MI2a: satisfying Depends: /usr/bin/gpg2 (NULL)
[x86_64] MI2a: maybe install (a providing target): gnupg2 2.4.3-alt1:sisyphus+346255.200.2.1 at 1716418264
[x86_64] MI2a: target SELECTED: gnupg2 2.4.3-alt1:sisyphus+346255.200.2.1 at 1716418264
[x86_64] MI2a: requesting to install gnupg2 (unspec'd ver; inspect with Debug::pkgMark-shallow)
[x86_64] MI2a: marked for install (shallow): gnupg2
[x86_64] MI2a: satisfying Depends: libassuan2.so.0()(64bit) >= set:kdTj18aV79AnslxNNYPpCkhYo8bWjEwdrXB49GzIfbAeu7FAsAGT18ZBDqEArMs82oRiGXqIDZGA5pkFCqs0knSl0p40qkmNp6wGobpqAxnCQoSfNaUdIYzHOeF8hDHsiiZ00E9gPrs7NFMZL1NHd3
[x86_64] MI2a: maybe install (a providing target): libassuan 2.5.6-alt1:sisyphus+327218.300.1.1 at 1692093921
[x86_64] MI2a: target SELECTED: libassuan 2.5.6-alt1:sisyphus+327218.300.1.1 at 1692093921
[x86_64] MI2a: requesting to install libassuan (unspec'd ver; inspect with Debug::pkgMark-shallow)
[x86_64] MI2a: marked for install (shallow): libassuan
[x86_64] MI2a: satisfying Depends: libksba.so.8()(64bit) >= set:leGMIZfIy8N6Cap7yZ8sCClknRYwdvrMu5jkEpHsF8mxoZ6n3Zsp7R0XZ6m1ew6UtqOsiKNMYkU2R7wUBQGpLZ1SLsNyBCwCAS9z7PSz8nfYhPLZejBvJ5vFkJoy88iERFe7exAWaWjgNpkZhyOlg81Ezn2jGga8O0qBTXzvmZsjMkffZybJBcy7txJpAJBSwowhTImBbEBK0f98IGIEBGfXcgsXCoR7ZvuipeY6QfqVQonPyCwJrpJWfGw6LUBXgNBBcNTwDv
[x86_64] MI2a: maybe install (a providing target): libksba 1.6.4-alt1:sisyphus+327218.400.1.1 at 1692093956
[x86_64] MI2a: target SELECTED: libksba 1.6.4-alt1:sisyphus+327218.400.1.1 at 1692093956
[x86_64] MI2a: requesting to install libksba (unspec'd ver; inspect with Debug::pkgMark-shallow)
[x86_64] MI2a: marked for install (shallow): libksba
[x86_64] MI2a: satisfying Depends: libnpth.so.0()(64bit) >= set:jefTyCkyFgpxLHLbgCda1ZJWaiN0OrZbpushD4Ct8zfriiFcr6p5EqT6
[x86_64] MI2a: maybe install (a providing target): libnpth 1.6.0.20.g7e45b50-alt3:sisyphus+278566.100.1.1 at 1626114690
[x86_64] MI2a: target SELECTED: libnpth 1.6.0.20.g7e45b50-alt3:sisyphus+278566.100.1.1 at 1626114690
[x86_64] MI2a: requesting to install libnpth (unspec'd ver; inspect with Debug::pkgMark-shallow)
[x86_64] MI2a: marked for install (shallow): libnpth
[x86_64] MI2a: satisfying Depends: libusb-1.0.so.0()(64bit) >= set:kfVTRgguDvWjFX2kiQyBxcZbyX0fNqRv2rle7qFW8m22TdYYa99G1IIXZ2
[x86_64] MI2a: maybe install (a providing target): libusb 1.0.27-alt1:sisyphus+347412.100.1.1 at 1714739651
[x86_64] MI2a: target SELECTED: libusb 1.0.27-alt1:sisyphus+347412.100.1.1 at 1714739651
[x86_64] MI2a: requesting to install libusb (unspec'd ver; inspect with Debug::pkgMark-shallow)
[x86_64] MI2a: marked for install (shallow): libusb
[x86_64] MI2a: satisfying Depends: libldb-modules-ldap = 4.21.4-alt1:sisyphus+380427.500.4.1
[x86_64] MI2a: maybe install (a direct target): libldb-modules-ldap 4.21.4-alt1:sisyphus+380427.500.4.1 at 1743800937
[x86_64] MI2a: target SELECTED: libldb-modules-ldap 4.21.4-alt1:sisyphus+380427.500.4.1 at 1743800937
[x86_64] MI2a: requesting to install libldb-modules-ldap (unspec'd ver; inspect with Debug::pkgMark-shallow)
[x86_64] MI2a: marked for install (shallow): libldb-modules-ldap
[x86_64] MI2a: satisfying Depends: samba-libs = 4.21.4-alt1:sisyphus+380427.500.4.1
[x86_64] MI2a: maybe install (a direct target): samba-libs 4.21.4-alt1:sisyphus+380427.500.4.1 at 1743800937
[x86_64] MI2a: target SELECTED: samba-libs 4.21.4-alt1:sisyphus+380427.500.4.1 at 1743800937
[x86_64] MI2a: requesting to install samba-libs (unspec'd ver; inspect with Debug::pkgMark-shallow)
[x86_64] MI2a: marked for install (shallow): samba-libs
[x86_64] MI2a: satisfying Depends: libavahi-client.so.3()(64bit) >= set:jfJsw5C4nbG1HJUghb3L0F20
[x86_64] MI2a: maybe install (a providing target): libavahi 0.8-alt5:sisyphus+370646.100.1.1 at 1737385841
[x86_64] MI2a: target SELECTED: libavahi 0.8-alt5:sisyphus+370646.100.1.1 at 1737385841
[x86_64] MI2a: requesting to install libavahi (unspec'd ver; inspect with Debug::pkgMark-shallow)
[x86_64] MI2a: marked for install (shallow): libavahi
[x86_64] MI2a: satisfying Depends: samba-common-libs = 4.21.4-alt1:sisyphus+380427.500.4.1
[x86_64] MI2a: maybe install (a direct target): samba-common-libs 4.21.4-alt1:sisyphus+380427.500.4.1 at 1743800937
[x86_64] MI2a: target SELECTED: samba-common-libs 4.21.4-alt1:sisyphus+380427.500.4.1 at 1743800937
[x86_64] MI2a: requesting to install samba-common-libs (unspec'd ver; inspect with Debug::pkgMark-shallow)
[x86_64] MI2a: marked for install (shallow): samba-common-libs
[x86_64] MI2a: satisfying Depends: libicui18n.so.76()(64bit) >= set:rpvNljW0qmTAmt
[x86_64] MI2a: maybe install (a providing target): libicu76 1:7.6.1-alt1:sisyphus+375553.100.1.1 at 1740138060
[x86_64] MI2a: target SELECTED: libicu76 1:7.6.1-alt1:sisyphus+375553.100.1.1 at 1740138060
[x86_64] MI2a: requesting to install libicu76 (unspec'd ver; inspect with Debug::pkgMark-shallow)
[x86_64] MI2a: marked for install (shallow): libicu76
[x86_64] MI2a: satisfying Depends: libtdb.so.1()(64bit) >= set:kezcggewc5g5Qp6GgsvK0W8d0PSb7qxuKcKjoeRY78dMZ6qdSReInvzX3vJWiHm7W26RjJg4difZmTkE3
[x86_64] MI2a: maybe install (a providing target): libtdb 1.4.12-alt1:sisyphus+380427.100.1.1 at 1743794605
[x86_64] MI2a: target SELECTED: libtdb 1.4.12-alt1:sisyphus+380427.100.1.1 at 1743794605
[x86_64] MI2a: requesting to install libtdb (unspec'd ver; inspect with Debug::pkgMark-shallow)
[x86_64] MI2a: marked for install (shallow): libtdb
[x86_64] MI2a: satisfying Depends: libldb = 4.21.4-alt1:sisyphus+380427.500.4.1
[x86_64] MI2a: maybe install (a direct target): libldb 4.21.4-alt1:sisyphus+380427.500.4.1 at 1743800937
[x86_64] MI2a: target SELECTED: libldb 4.21.4-alt1:sisyphus+380427.500.4.1 at 1743800937
[x86_64] MI2a: requesting to install libldb (unspec'd ver; inspect with Debug::pkgMark-shallow)
[x86_64] MI2a: marked for install (shallow): libldb
[x86_64] MI2a: satisfying Depends: libwbclient = 4.21.4-alt1:sisyphus+380427.500.4.1
[x86_64] MI2a: maybe install (a direct target): libwbclient 4.21.4-alt1:sisyphus+380427.500.4.1 at 1743800937
[x86_64] MI2a: target SELECTED: libwbclient 4.21.4-alt1:sisyphus+380427.500.4.1 at 1743800937
[x86_64] MI2a: requesting to install libwbclient (unspec'd ver; inspect with Debug::pkgMark-shallow)
[x86_64] MI2a: marked for install (shallow): libwbclient
[x86_64] MI2a: marked for install (shallow): node
[x86_64] MI2a: satisfying Depends: libbrotlienc.so.1()(64bit) >= set:hessqPjZghmer1
[x86_64] MI2a: maybe install (a providing target): libbrotlienc 1.1.0-alt1:sisyphus+328501.100.1.1 at 1693598419
[x86_64] MI2a: target SELECTED: libbrotlienc 1.1.0-alt1:sisyphus+328501.100.1.1 at 1693598419
[x86_64] MI2a: requesting to install libbrotlienc (unspec'd ver; inspect with Debug::pkgMark-shallow)
[x86_64] MI2a: marked for install (shallow): libbrotlienc
[x86_64] MI2a: satisfying Depends: libcares.so.2()(64bit) >= set:niWsEebEq721xwAB9maWDKE6nk2Y1d9eMFx7neZ0rwUI9vFT2o92JHGHFUm5L76lXoVcBmeGPYWGoIQgoqC1
[x86_64] MI2a: maybe install (a providing target): libcares 1.34.4-alt1:sisyphus+366652.100.1.1 at 1735281164
[x86_64] MI2a: target SELECTED: libcares 1.34.4-alt1:sisyphus+366652.100.1.1 at 1735281164
[x86_64] MI2a: requesting to install libcares (unspec'd ver; inspect with Debug::pkgMark-shallow)
[x86_64] MI2a: marked for install (shallow): libcares
[x86_64] MI2a: satisfying Depends: libuv.so.1()(64bit) >= set:meRq1GKfdBv35grb1cULMZvQ10d4T0JUxAZAgZpP11lR5Tf1uPtZ0QNhdZbySzz4o1Z2TzkZFtIZ74CFieYPEaZodX3zQdJFbJAHwbpudvgZ2bQdmcUjVnvfdxMMOzjAFj1R5Z0ZoXAo9korxBZ2FmJsBC1r0wZJW074M3aJZ59ULKkqmOigt33yZxY74morM8Jw2WnoOfZGMyFWHyVt3cIe584dk6vM6uRtpgbKtkwV80JgtMXMIZILYr94RY0t46ak3RWBBGbUnKTiqgANFUMpZuLBZgsvTb25Vi1bBYrAc2sfuysmZIxx1M8Mb6OzOEE9pjUvFZw1RN2ToI6VnVKGYSTWXm5ZgTNpj1kZrpKmJUs76r4Ff5tEYmeUDMUTvEeGb0Zx2IXZmSiNoIi2w1gbavRjHWMqywiz1JyRtvzFOz6Xw1XtgPOZeUW8QpqrV3vjWmC7RCv3knhqLTxzDp9Vk71rSKNu4HM7VlltgB2KGvz3
[x86_64] MI2a: maybe install (a providing target): libuv 1.50.0-alt1:sisyphus+377760.100.1.1 at 1741795923
[x86_64] MI2a: target SELECTED: libuv 1.50.0-alt1:sisyphus+377760.100.1.1 at 1741795923
[x86_64] MI2a: requesting to install libuv (unspec'd ver; inspect with Debug::pkgMark-shallow)
[x86_64] MI2a: marked for install (shallow): libuv
[x86_64] MI2a: marked for install (shallow): python3-module-lesscpy
[x86_64] MI2a: satisfying Depends: python3-module-ply (NULL)
[x86_64] MI2a: maybe install (a direct target): python3-module-ply 3.11-alt3:sisyphus+339052.100.1.1 at 1706247931
[x86_64] MI2a: target SELECTED: python3-module-ply 3.11-alt3:sisyphus+339052.100.1.1 at 1706247931
[x86_64] MI2a: requesting to install python3-module-ply (unspec'd ver; inspect with Debug::pkgMark-shallow)
[x86_64] MI2a: marked for install (shallow): python3-module-ply
[x86_64] MI2a: marked for install (shallow): python3-module-setuptools
[x86_64] MI2a: satisfying Depends: python3-dev (NULL)
[x86_64] MI2a: maybe install (a direct target): python3-dev 3.12.9-alt1:sisyphus+376344.100.1.1 at 1740741913
[x86_64] MI2a: target SELECTED: python3-dev 3.12.9-alt1:sisyphus+376344.100.1.1 at 1740741913
[x86_64] MI2a: requesting to install python3-dev (unspec'd ver; inspect with Debug::pkgMark-shallow)
[x86_64] MI2a: marked for install (shallow): python3-dev
[x86_64] MI2a: satisfying Depends: libncurses-devel (NULL)
[x86_64] MI2a: maybe install (a direct target): libncurses-devel 6.3.20220618-alt4:sisyphus+327286.4600.14.1 at 1711486705
[x86_64] MI2a: target SELECTED: libncurses-devel 6.3.20220618-alt4:sisyphus+327286.4600.14.1 at 1711486705
[x86_64] MI2a: requesting to install libncurses-devel (unspec'd ver; inspect with Debug::pkgMark-shallow)
[x86_64] MI2a: marked for install (shallow): libncurses-devel
[x86_64] MI2a: satisfying Depends: libtinfo-devel = 6.3.20220618-alt4:sisyphus+327286.4600.14.1
[x86_64] MI2a: maybe install (a direct target): libtinfo-devel 6.3.20220618-alt4:sisyphus+327286.4600.14.1 at 1711486705
[x86_64] MI2a: target SELECTED: libtinfo-devel 6.3.20220618-alt4:sisyphus+327286.4600.14.1 at 1711486705
[x86_64] MI2a: requesting to install libtinfo-devel (unspec'd ver; inspect with Debug::pkgMark-shallow)
[x86_64] MI2a: marked for install (shallow): libtinfo-devel
[x86_64] MI2a: satisfying Depends: libncurses6 = 6.3.20220618-alt4:sisyphus+327286.4600.14.1
[x86_64] MI2a: maybe install (a direct target): libncurses6 6.3.20220618-alt4:sisyphus+327286.4600.14.1 at 1711486705
[x86_64] MI2a: target SELECTED: libncurses6 6.3.20220618-alt4:sisyphus+327286.4600.14.1 at 1711486705
[x86_64] MI2a: requesting to install libncurses6 (unspec'd ver; inspect with Debug::pkgMark-shallow)
[x86_64] MI2a: marked for install (shallow): libncurses6
[x86_64] MI2a: satisfying Depends: libpython3 = 3.12.9-alt1:sisyphus+376344.100.1.1
[x86_64] MI2a: maybe install (a direct target): libpython3 3.12.9-alt1:sisyphus+376344.100.1.1 at 1740741913
[x86_64] MI2a: target SELECTED: libpython3 3.12.9-alt1:sisyphus+376344.100.1.1 at 1740741913
[x86_64] MI2a: requesting to install libpython3 (unspec'd ver; inspect with Debug::pkgMark-shallow)
[x86_64] MI2a: marked for install (shallow): libpython3
[x86_64] MI2a: satisfying Depends: python3-module-pkg_resources = 1:75.8.0-alt3:sisyphus+377826.100.1.1
[x86_64] MI2a: maybe install (a direct target): python3-module-pkg_resources 1:75.8.0-alt3:sisyphus+377826.100.1.1 at 1741863600
[x86_64] MI2a: target SELECTED: python3-module-pkg_resources 1:75.8.0-alt3:sisyphus+377826.100.1.1 at 1741863600
[x86_64] MI2a: requesting to install python3-module-pkg_resources (unspec'd ver; inspect with Debug::pkgMark-shallow)
[x86_64] MI2a: marked for install (shallow): python3-module-pkg_resources
[x86_64] MI2a: satisfying Depends: python3-module-jaraco-collections (NULL)
[x86_64] MI2a: maybe install (a providing target): python3-module-jaraco.collections 5.1.0-alt1:sisyphus+357809.200.1.1 at 1726769173
[x86_64] MI2a: target SELECTED: python3-module-jaraco.collections 5.1.0-alt1:sisyphus+357809.200.1.1 at 1726769173
[x86_64] MI2a: requesting to install python3-module-jaraco.collections (unspec'd ver; inspect with Debug::pkgMark-shallow)
[x86_64] MI2a: marked for install (shallow): python3-module-jaraco.collections
[x86_64] MI2a: satisfying Depends: python3-module-jaraco-text (NULL)
[x86_64] MI2a: maybe install (a providing target): python3-module-jaraco.text 4.0.0-alt1:sisyphus+353877.400.2.1 at 1722250727
[x86_64] MI2a: target SELECTED: python3-module-jaraco.text 4.0.0-alt1:sisyphus+353877.400.2.1 at 1722250727
[x86_64] MI2a: requesting to install python3-module-jaraco.text (unspec'd ver; inspect with Debug::pkgMark-shallow)
[x86_64] MI2a: marked for install (shallow): python3-module-jaraco.text
[x86_64] MI2a: satisfying Depends: python3-module-autocommand (NULL)
[x86_64] MI2a: maybe install (a direct target): python3-module-autocommand 2.2.2-alt1.1:sisyphus+339714.100.1.1 at 1706968174
[x86_64] MI2a: target SELECTED: python3-module-autocommand 2.2.2-alt1.1:sisyphus+339714.100.1.1 at 1706968174
[x86_64] MI2a: requesting to install python3-module-autocommand (unspec'd ver; inspect with Debug::pkgMark-shallow)
[x86_64] MI2a: marked for install (shallow): python3-module-autocommand
[x86_64] MI2a: satisfying Depends: python3-module-jaraco-context (NULL)
[x86_64] MI2a: maybe install (a providing target): python3-module-jaraco.context 6.0.1-alt1:sisyphus+357809.300.1.1 at 1726769204
[x86_64] MI2a: target SELECTED: python3-module-jaraco.context 6.0.1-alt1:sisyphus+357809.300.1.1 at 1726769204
[x86_64] MI2a: requesting to install python3-module-jaraco.context (unspec'd ver; inspect with Debug::pkgMark-shallow)
[x86_64] MI2a: marked for install (shallow): python3-module-jaraco.context
[x86_64] MI2a: satisfying Depends: python3-module-jaraco-functools (NULL)
[x86_64] MI2a: maybe install (a providing target): python3-module-jaraco.functools 4.1.0-alt1:sisyphus+358564.100.1.1 at 1727528718
[x86_64] MI2a: target SELECTED: python3-module-jaraco.functools 4.1.0-alt1:sisyphus+358564.100.1.1 at 1727528718
[x86_64] MI2a: requesting to install python3-module-jaraco.functools (unspec'd ver; inspect with Debug::pkgMark-shallow)
[x86_64] MI2a: marked for install (shallow): python3-module-jaraco.functools
[x86_64] MI2a: satisfying Depends: python3(more_itertools) < 0
[x86_64] MI2a: maybe install (a providing target): python3-module-more-itertools 10.6.0-alt1:sisyphus+369595.100.2.1 at 1737017267
[x86_64] MI2a: target SELECTED: python3-module-more-itertools 10.6.0-alt1:sisyphus+369595.100.2.1 at 1737017267
[x86_64] MI2a: requesting to install python3-module-more-itertools (unspec'd ver; inspect with Debug::pkgMark-shallow)
[x86_64] MI2a: marked for install (shallow): python3-module-more-itertools
[x86_64] MI2a: satisfying Depends: python3-module-packaging (NULL)
[x86_64] MI2a: maybe install (a direct target): python3-module-packaging 24.2-alt1:sisyphus+362183.100.1.1 at 1731315992
[x86_64] MI2a: target SELECTED: python3-module-packaging 24.2-alt1:sisyphus+362183.100.1.1 at 1731315992
[x86_64] MI2a: requesting to install python3-module-packaging (unspec'd ver; inspect with Debug::pkgMark-shallow)
[x86_64] MI2a: marked for install (shallow): python3-module-packaging
[x86_64] MI2a: satisfying Depends: python3-module-platformdirs (NULL)
[x86_64] MI2a: maybe install (a direct target): python3-module-platformdirs 4.3.7-alt1:sisyphus+378659.100.2.1 at 1742562597
[x86_64] MI2a: target SELECTED: python3-module-platformdirs 4.3.7-alt1:sisyphus+378659.100.2.1 at 1742562597
[x86_64] MI2a: requesting to install python3-module-platformdirs (unspec'd ver; inspect with Debug::pkgMark-shallow)
[x86_64] MI2a: marked for install (shallow): python3-module-platformdirs
[x86_64] MI2a: satisfying Depends: python3-module-wheel (NULL)
[x86_64] MI2a: maybe install (a direct target): python3-module-wheel 0.45.1-alt1:sisyphus+363326.100.2.1 at 1732609968
[x86_64] MI2a: target SELECTED: python3-module-wheel 0.45.1-alt1:sisyphus+363326.100.2.1 at 1732609968
[x86_64] MI2a: requesting to install python3-module-wheel (unspec'd ver; inspect with Debug::pkgMark-shallow)
[x86_64] MI2a: marked for install (shallow): python3-module-wheel
[x86_64] MI2a: marked for install (shallow): python3-module-dns
[x86_64] MI2a: satisfying Depends: python3(trio) < 0
[x86_64] MI2a: maybe install (a providing target): python3-module-trio 0.29.0-alt1:sisyphus+376073.100.1.1 at 1740492646
[x86_64] MI2a: target SELECTED: python3-module-trio 0.29.0-alt1:sisyphus+376073.100.1.1 at 1740492646
[x86_64] MI2a: requesting to install python3-module-trio (unspec'd ver; inspect with Debug::pkgMark-shallow)
[x86_64] MI2a: marked for install (shallow): python3-module-trio
[x86_64] MI2a: satisfying Depends: python3(astor) < 0
[x86_64] MI2a: maybe install (a providing target): python3-module-astor 0.8.1-alt1.1:sisyphus+315877.100.1.1 at 1677481862
[x86_64] MI2a: target SELECTED: python3-module-astor 0.8.1-alt1.1:sisyphus+315877.100.1.1 at 1677481862
[x86_64] MI2a: requesting to install python3-module-astor (unspec'd ver; inspect with Debug::pkgMark-shallow)
[x86_64] MI2a: marked for install (shallow): python3-module-astor
[x86_64] MI2a: satisfying Depends: python3(attrs) < 0
[x86_64] MI2a: maybe install (a providing target): python3-module-attrs 25.3.0-alt1:sisyphus+378700.100.1.1 at 1742472992
[x86_64] MI2a: target SELECTED: python3-module-attrs 25.3.0-alt1:sisyphus+378700.100.1.1 at 1742472992
[x86_64] MI2a: requesting to install python3-module-attrs (unspec'd ver; inspect with Debug::pkgMark-shallow)
[x86_64] MI2a: marked for install (shallow): python3-module-attrs
[x86_64] MI2a: satisfying Depends: python3(idna) < 0
[x86_64] MI2a: maybe install (a providing target): python3-module-idna 3.10-alt1:sisyphus+358681.100.1.1 at 1727701241
[x86_64] MI2a: target SELECTED: python3-module-idna 3.10-alt1:sisyphus+358681.100.1.1 at 1727701241
[x86_64] MI2a: requesting to install python3-module-idna (unspec'd ver; inspect with Debug::pkgMark-shallow)
[x86_64] MI2a: marked for install (shallow): python3-module-idna
[x86_64] MI2a: satisfying Depends: python3(outcome) < 0
[x86_64] MI2a: maybe install (a providing target): python3-module-outcome 1.3.0-alt1:sisyphus+332382.100.1.1 at 1697882349
[x86_64] MI2a: target SELECTED: python3-module-outcome 1.3.0-alt1:sisyphus+332382.100.1.1 at 1697882349
[x86_64] MI2a: requesting to install python3-module-outcome (unspec'd ver; inspect with Debug::pkgMark-shallow)
[x86_64] MI2a: marked for install (shallow): python3-module-outcome
[x86_64] MI2a: satisfying Depends: python3(sniffio) < 0
[x86_64] MI2a: maybe install (a providing target): python3-module-sniffio 1.3.1-alt1:sisyphus+341424.100.1.1 at 1708941879
[x86_64] MI2a: target SELECTED: python3-module-sniffio 1.3.1-alt1:sisyphus+341424.100.1.1 at 1708941879
[x86_64] MI2a: requesting to install python3-module-sniffio (unspec'd ver; inspect with Debug::pkgMark-shallow)
[x86_64] MI2a: marked for install (shallow): python3-module-sniffio
[x86_64] MI2a: satisfying Depends: python3(sortedcontainers) < 0
[x86_64] MI2a: maybe install (a providing target): python3-module-sortedcontainers 2.4.0-alt1:sisyphus+272042.100.1.1 at 1621262424
[x86_64] MI2a: target SELECTED: python3-module-sortedcontainers 2.4.0-alt1:sisyphus+272042.100.1.1 at 1621262424
[x86_64] MI2a: requesting to install python3-module-sortedcontainers (unspec'd ver; inspect with Debug::pkgMark-shallow)
[x86_64] MI2a: marked for install (shallow): python3-module-sortedcontainers
[x86_64] MI2a: marked for install (shallow): python3-module-gssapi
[x86_64] MI2a: satisfying Depends: python3-module-decorator (NULL)
[x86_64] MI2a: maybe install (a direct target): python3-module-decorator 5.2.1-alt1:sisyphus+376067.100.1.1 at 1740491622
[x86_64] MI2a: target SELECTED: python3-module-decorator 5.2.1-alt1:sisyphus+376067.100.1.1 at 1740491622
[x86_64] MI2a: requesting to install python3-module-decorator (unspec'd ver; inspect with Debug::pkgMark-shallow)
[x86_64] MI2a: marked for install (shallow): python3-module-decorator
[x86_64] MI2a: marked for install (shallow): python3-module-lxml
[x86_64] MI2a: satisfying Depends: python3-module-cssselect (NULL)
[x86_64] MI2a: maybe install (a direct target): python3-module-cssselect 1.3.0-alt1:sisyphus+377617.100.1.1 at 1741681780
[x86_64] MI2a: target SELECTED: python3-module-cssselect 1.3.0-alt1:sisyphus+377617.100.1.1 at 1741681780
[x86_64] MI2a: requesting to install python3-module-cssselect (unspec'd ver; inspect with Debug::pkgMark-shallow)
[x86_64] MI2a: marked for install (shallow): python3-module-cssselect
[x86_64] MI2a: satisfying Depends: libexslt.so.0()(64bit) >= set:ifFYpbWiXMSnz0
[x86_64] MI2a: maybe install (a providing target): libxslt 1.1.39-alt1:sisyphus+349406.100.1.1 at 1716751806
[x86_64] MI2a: target SELECTED: libxslt 1.1.39-alt1:sisyphus+349406.100.1.1 at 1716751806
[x86_64] MI2a: requesting to install libxslt (unspec'd ver; inspect with Debug::pkgMark-shallow)
[x86_64] MI2a: marked for install (shallow): libxslt
[x86_64] MI2a: satisfying Depends: python3(html5lib) < 0
[x86_64] MI2a: maybe install (a providing target): python3-module-html5lib 1:1.1-alt1:sisyphus+278096.120.5.1 at 1626086978
[x86_64] MI2a: target SELECTED: python3-module-html5lib 1:1.1-alt1:sisyphus+278096.120.5.1 at 1626086978
[x86_64] MI2a: requesting to install python3-module-html5lib (unspec'd ver; inspect with Debug::pkgMark-shallow)
[x86_64] MI2a: marked for install (shallow): python3-module-html5lib
[x86_64] MI2a: satisfying Depends: python3(genshi.core) < 0
[x86_64] MI2a: maybe install (a providing target): python3-module-genshi 0.7.9-alt2:sisyphus+359540.100.1.1 at 1728646235
[x86_64] MI2a: target SELECTED: python3-module-genshi 0.7.9-alt2:sisyphus+359540.100.1.1 at 1728646235
[x86_64] MI2a: requesting to install python3-module-genshi (unspec'd ver; inspect with Debug::pkgMark-shallow)
[x86_64] MI2a: marked for install (shallow): python3-module-genshi
[x86_64] MI2a: satisfying Depends: python3(webencodings) < 0
[x86_64] MI2a: maybe install (a providing target): python3-module-webencodings 0.5.1-alt3:sisyphus+359244.100.1.1 at 1728381102
[x86_64] MI2a: target SELECTED: python3-module-webencodings 0.5.1-alt3:sisyphus+359244.100.1.1 at 1728381102
[x86_64] MI2a: requesting to install python3-module-webencodings (unspec'd ver; inspect with Debug::pkgMark-shallow)
[x86_64] MI2a: marked for install (shallow): python3-module-webencodings
[x86_64] MI2a: marked for install (shallow): python3-module-dogtag-pki
[x86_64] MI2a: satisfying Depends: python3(requests) < 0
[x86_64] MI2a: maybe install (a providing target): python3-module-requests 2.32.3-alt1:sisyphus+349946.100.1.1 at 1717059877
[x86_64] MI2a: target SELECTED: python3-module-requests 2.32.3-alt1:sisyphus+349946.100.1.1 at 1717059877
[x86_64] MI2a: requesting to install python3-module-requests (unspec'd ver; inspect with Debug::pkgMark-shallow)
[x86_64] MI2a: marked for install (shallow): python3-module-requests
[x86_64] MI2a: satisfying Depends: python3-module-charset-normalizer (NULL)
[x86_64] MI2a: maybe install (a direct target): python3-module-charset-normalizer 3.2.0-alt1:sisyphus+347396.200.2.1 at 1714733155
[x86_64] MI2a: target SELECTED: python3-module-charset-normalizer 3.2.0-alt1:sisyphus+347396.200.2.1 at 1714733155
[x86_64] MI2a: requesting to install python3-module-charset-normalizer (unspec'd ver; inspect with Debug::pkgMark-shallow)
[x86_64] MI2a: marked for install (shallow): python3-module-charset-normalizer
[x86_64] MI2a: satisfying Depends: python3-module-urllib3 (NULL)
[x86_64] MI2a: maybe install (a direct target): python3-module-urllib3 2:2.3.0-alt1:sisyphus+366320.100.2.1 at 1735116352
[x86_64] MI2a: target SELECTED: python3-module-urllib3 2:2.3.0-alt1:sisyphus+366320.100.2.1 at 1735116352
[x86_64] MI2a: requesting to install python3-module-urllib3 (unspec'd ver; inspect with Debug::pkgMark-shallow)
[x86_64] MI2a: marked for install (shallow): python3-module-urllib3
[x86_64] MI2a: satisfying Depends: dogtag-pki-base = 11.4.3-alt5:sisyphus+373166.100.1.1
[x86_64] MI2a: maybe install (a direct target): dogtag-pki-base 11.4.3-alt5:sisyphus+373166.100.1.1 at 1738678390
[x86_64] MI2a: target SELECTED: dogtag-pki-base 11.4.3-alt5:sisyphus+373166.100.1.1 at 1738678390
[x86_64] MI2a: requesting to install dogtag-pki-base (unspec'd ver; inspect with Debug::pkgMark-shallow)
[x86_64] MI2a: marked for install (shallow): dogtag-pki-base
[x86_64] MI2a: marked for install (shallow): python3-module-pytest
[x86_64] MI2a: satisfying Depends: python3-module-iniconfig (NULL)
[x86_64] MI2a: maybe install (a direct target): python3-module-iniconfig 2.1.0-alt1:sisyphus+378658.100.2.1 at 1742493599
[x86_64] MI2a: target SELECTED: python3-module-iniconfig 2.1.0-alt1:sisyphus+378658.100.2.1 at 1742493599
[x86_64] MI2a: requesting to install python3-module-iniconfig (unspec'd ver; inspect with Debug::pkgMark-shallow)
[x86_64] MI2a: marked for install (shallow): python3-module-iniconfig
[x86_64] MI2a: satisfying Depends: python3-module-pluggy (NULL)
[x86_64] MI2a: maybe install (a direct target): python3-module-pluggy 1.5.0-alt1:sisyphus+345632.100.2.1 at 1713864244
[x86_64] MI2a: target SELECTED: python3-module-pluggy 1.5.0-alt1:sisyphus+345632.100.2.1 at 1713864244
[x86_64] MI2a: requesting to install python3-module-pluggy (unspec'd ver; inspect with Debug::pkgMark-shallow)
[x86_64] MI2a: marked for install (shallow): python3-module-pluggy
[x86_64] MI2a: marked for install (shallow): python3-module-jwcrypto
[x86_64] MI2a: satisfying Depends: python3-module-typing-extensions (NULL)
[x86_64] MI2a: maybe install (a providing target): python3-module-typing_extensions 4.13.0-alt1:sisyphus+379896.100.1.1 at 1743509204
[x86_64] MI2a: target SELECTED: python3-module-typing_extensions 4.13.0-alt1:sisyphus+379896.100.1.1 at 1743509204
[x86_64] MI2a: requesting to install python3-module-typing_extensions (unspec'd ver; inspect with Debug::pkgMark-shallow)
[x86_64] MI2a: marked for install (shallow): python3-module-typing_extensions
[x86_64] MI2a: marked for install (shallow): python3-module-augeas
[x86_64] MI2a: satisfying Depends: libaugeas (NULL)
[x86_64] MI2a: maybe install (a direct target): libaugeas 1.14.1-alt1:sisyphus+352945.400.5.1 at 1721548687
[x86_64] MI2a: target SELECTED: libaugeas 1.14.1-alt1:sisyphus+352945.400.5.1 at 1721548687
[x86_64] MI2a: requesting to install libaugeas (unspec'd ver; inspect with Debug::pkgMark-shallow)
[x86_64] MI2a: marked for install (shallow): libaugeas
[x86_64] MI2a: marked for install (shallow): python3-module-pexpect
[x86_64] MI2a: satisfying Depends: python3(ptyprocess) < 0
[x86_64] MI2a: maybe install (a providing target): python3-module-ptyprocess 0.7.0-alt1:sisyphus+283469.100.1.1 at 1629400504
[x86_64] MI2a: target SELECTED: python3-module-ptyprocess 0.7.0-alt1:sisyphus+283469.100.1.1 at 1629400504
[x86_64] MI2a: requesting to install python3-module-ptyprocess (unspec'd ver; inspect with Debug::pkgMark-shallow)
[x86_64] MI2a: marked for install (shallow): python3-module-ptyprocess
[x86_64] MI2a: marked for install (shallow): python3-module-jinja2
[x86_64] MI2a: satisfying Depends: python3(markupsafe) < 0
[x86_64] MI2a: maybe install (a providing target): python3-module-markupsafe 1:3.0.2-alt1:sisyphus+360209.100.1.1 at 1729323052
[x86_64] MI2a: target SELECTED: python3-module-markupsafe 1:3.0.2-alt1:sisyphus+360209.100.1.1 at 1729323052
[x86_64] MI2a: requesting to install python3-module-markupsafe (unspec'd ver; inspect with Debug::pkgMark-shallow)
[x86_64] MI2a: marked for install (shallow): python3-module-markupsafe
[x86_64] MI2a: marked for install (shallow): python3-module-yubico
[x86_64] MI2a: satisfying Depends: python3(usb) < 0
[x86_64] MI2a: maybe install (a providing target): python3-module-pyusb 1.3.1-alt1:sisyphus+368387.100.1.1 at 1736419049
[x86_64] MI2a: target SELECTED: python3-module-pyusb 1.3.1-alt1:sisyphus+368387.100.1.1 at 1736419049
[x86_64] MI2a: requesting to install python3-module-pyusb (unspec'd ver; inspect with Debug::pkgMark-shallow)
[x86_64] MI2a: marked for install (shallow): python3-module-pyusb
[x86_64] MI2a: marked for install (shallow): python3-module-ipa_hbac
[x86_64] MI2a: satisfying Depends: libipa_hbac = 2.9.6-alt3:sisyphus+380427.1000.7.1
[x86_64] MI2a: maybe install (a direct target): libipa_hbac 2.9.6-alt3:sisyphus+380427.1000.7.1 at 1743804358
[x86_64] MI2a: target SELECTED: libipa_hbac 2.9.6-alt3:sisyphus+380427.1000.7.1 at 1743804358
[x86_64] MI2a: requesting to install libipa_hbac (unspec'd ver; inspect with Debug::pkgMark-shallow)
[x86_64] MI2a: marked for install (shallow): libipa_hbac
[x86_64] MI2a: marked for install (shallow): python3-module-yaml
[x86_64] MI2a: satisfying Depends: libyaml-0.so.2()(64bit) >= set:jeDuSUAbEuz1xrY3muBZ56F9Jbi2W3kR6iB5oRQxGfDDGyazcKxJ4shcJWS8IVb7
[x86_64] MI2a: maybe install (a providing target): libyaml2 0.2.5-alt1:sisyphus+278391.100.1.1 at 1626094928
[x86_64] MI2a: target SELECTED: libyaml2 0.2.5-alt1:sisyphus+278391.100.1.1 at 1626094928
[x86_64] MI2a: requesting to install libyaml2 (unspec'd ver; inspect with Debug::pkgMark-shallow)
[x86_64] MI2a: marked for install (shallow): libyaml2
[x86_64] MI2a: marked for install (shallow): python3-module-sss
[x86_64] MI2a: satisfying Depends: sssd = 2.9.6-alt3:sisyphus+380427.1000.7.1
[x86_64] MI2a: maybe install (a direct target): sssd 2.9.6-alt3:sisyphus+380427.1000.7.1 at 1743804358
[x86_64] MI2a: target SELECTED: sssd 2.9.6-alt3:sisyphus+380427.1000.7.1 at 1743804358
[x86_64] MI2a: requesting to install sssd (unspec'd ver; inspect with Debug::pkgMark-shallow)
[x86_64] MI2a: marked for install (shallow): sssd
[x86_64] MI2a: satisfying Depends: libldb = 2.10.0
[x86_64] MI2a: satisfying Depends: local-policy >= 0.4.8
[x86_64] MI2a: maybe install (a direct target): local-policy 0.6.3-alt1:sisyphus+341643.100.1.1 at 1709161306
[x86_64] MI2a: target SELECTED: local-policy 0.6.3-alt1:sisyphus+341643.100.1.1 at 1709161306
[x86_64] MI2a: requesting to install local-policy (unspec'd ver; inspect with Debug::pkgMark-shallow)
[x86_64] MI2a: marked for install (shallow): local-policy
[x86_64] MI2a: satisfying Depends: control-sshd-permit-root-login (NULL)
[x86_64] MI2a: maybe install (a direct target): control-sshd-permit-root-login 0.0.1-alt2:sisyphus+281234.100.2.1 at 1627489182
[x86_64] MI2a: target SELECTED: control-sshd-permit-root-login 0.0.1-alt2:sisyphus+281234.100.2.1 at 1627489182
[x86_64] MI2a: requesting to install control-sshd-permit-root-login (unspec'd ver; inspect with Debug::pkgMark-shallow)
[x86_64] MI2a: marked for install (shallow): control-sshd-permit-root-login
[x86_64] MI2a: satisfying Depends: /etc/logrotate.d (NULL)
[x86_64] MI2a: maybe install (a providing target): logrotate 3.20.1-alt2:sisyphus+321776.100.2.1 at 1684960309
[x86_64] MI2a: target SELECTED: logrotate 3.20.1-alt2:sisyphus+321776.100.2.1 at 1684960309
[x86_64] MI2a: requesting to install logrotate (unspec'd ver; inspect with Debug::pkgMark-shallow)
[x86_64] MI2a: marked for install (shallow): logrotate
[x86_64] MI2a: satisfying Depends: /etc/cron.daily (NULL)
[x86_64] MI2a: maybe install (a providing target): crontabs 1.8-alt1:sisyphus+276803.100.1.1 at 1625236331
[x86_64] MI2a: target SELECTED: crontabs 1.8-alt1:sisyphus+276803.100.1.1 at 1625236331
[x86_64] MI2a: requesting to install crontabs (unspec'd ver; inspect with Debug::pkgMark-shallow)
[x86_64] MI2a: marked for install (shallow): crontabs
[x86_64] MI2a: satisfying Depends: vixie-cron (NULL)
[x86_64] MI2a: maybe install (a direct target): vixie-cron 4.1.20060426-alt10.3:sisyphus+302849.200.2.1 at 1656579733
[x86_64] MI2a: target SELECTED: vixie-cron 4.1.20060426-alt10.3:sisyphus+302849.200.2.1 at 1656579733
[x86_64] MI2a: requesting to install vixie-cron (unspec'd ver; inspect with Debug::pkgMark-shallow)
[x86_64] MI2a: marked for install (shallow): vixie-cron
[x86_64] MI2a: satisfying PreDepends: crontab-control (NULL)
[x86_64] MI2a: maybe install (a direct target): crontab-control 1.1-alt1:sisyphus+276802.100.1.1 at 1625236144
[x86_64] MI2a: target SELECTED: crontab-control 1.1-alt1:sisyphus+276802.100.1.1 at 1625236144
[x86_64] MI2a: requesting to install crontab-control (unspec'd ver; inspect with Debug::pkgMark-shallow)
[x86_64] MI2a: marked for install (shallow): crontab-control
[x86_64] MI2a: satisfying Depends: libsetproctitle.so.0()(64bit) >= set:dcf7
[x86_64] MI2a: maybe install (a providing target): setproctitle 0.3.2-alt3:sisyphus+278100.6300.1.1 at 1626060226
[x86_64] MI2a: target SELECTED: setproctitle 0.3.2-alt3:sisyphus+278100.6300.1.1 at 1626060226
[x86_64] MI2a: requesting to install setproctitle (unspec'd ver; inspect with Debug::pkgMark-shallow)
[x86_64] MI2a: marked for install (shallow): setproctitle
[x86_64] MI2a: satisfying Depends: libdhash.so.1()(64bit) >= set:hdfFHHuG3QAwjlKZwhCXwBzVw8Bwx2
[x86_64] MI2a: maybe install (a providing target): libdhash 0.5.0-alt6:sisyphus+346133.200.2.1 at 1716296158
[x86_64] MI2a: target SELECTED: libdhash 0.5.0-alt6:sisyphus+346133.200.2.1 at 1716296158
[x86_64] MI2a: requesting to install libdhash (unspec'd ver; inspect with Debug::pkgMark-shallow)
[x86_64] MI2a: marked for install (shallow): libdhash
[x86_64] MI2a: satisfying Depends: libsemanage.so.2()(64bit) >= set:mhjrhCWLEgzdZGmaHYFyyZLYYj5np6NaPawrt6XXaqpKgYl1ArN6xaY2pOMjwqH7
[x86_64] MI2a: maybe install (a providing target): libsemanage 1:3.8.1-alt1:sisyphus+377437.300.3.1 at 1742922374
[x86_64] MI2a: target SELECTED: libsemanage 1:3.8.1-alt1:sisyphus+377437.300.3.1 at 1742922374
[x86_64] MI2a: requesting to install libsemanage (unspec'd ver; inspect with Debug::pkgMark-shallow)
[x86_64] MI2a: marked for install (shallow): libsemanage
[x86_64] MI2a: satisfying Depends: libsepol.so.2()(64bit) >= set:me62fqSKUJ6ehe7Z4zBDOqGeXBWVvyO5NZy9UCl29zZKX88Wcb02LCPkxujar0drVUdjefS4G1vzxJUHStCCkEL0gBF2Fy33Y4qp7tfQB8xvoMvBLOgeCT24MwK21dnHD3G7WgEBGvrE3QFOM4HojD55O3cQCcZsCX1pFi5ZEas7nJZBHEgTE15zrZKtJP9qaxego5nr5jCJa8jZAAiGexaN03ETqNqL8HOcXaOoCHPehKZelFybL5Jd4x8zcqmMhGWU2paNMOlmlYMqcvoikmzYl96tCnt6vaqELwApU9p7S9SY95PYmTa6gEmEZeO59x93RuU969j5QTcZ8FjJXNv7HSCwBDYHnyfD1ZERZsaiJZxPCF5cJ9krj4KXDG1j6UBFfmZ4t7rQYUUB8w8XlsM1RZitzlNvtV4HHIVkbwTy4xZgHHKArlKc13PV06pOh0
[x86_64] MI2a: maybe install (a providing target): libsepol 1:3.8.1-alt1:sisyphus+377437.100.3.1 at 1742922240
[x86_64] MI2a: target SELECTED: libsepol 1:3.8.1-alt1:sisyphus+377437.100.3.1 at 1742922240
[x86_64] MI2a: requesting to install libsepol (unspec'd ver; inspect with Debug::pkgMark-shallow)
[x86_64] MI2a: marked for install (shallow): libsepol
[x86_64] MI2a: satisfying Depends: sssd-client = 2.9.6-alt3:sisyphus+380427.1000.7.1
[x86_64] MI2a: maybe install (a direct target): sssd-client 2.9.6-alt3:sisyphus+380427.1000.7.1 at 1743804358
[x86_64] MI2a: target SELECTED: sssd-client 2.9.6-alt3:sisyphus+380427.1000.7.1 at 1743804358
[x86_64] MI2a: requesting to install sssd-client (unspec'd ver; inspect with Debug::pkgMark-shallow)
[x86_64] MI2a: marked for install (shallow): sssd-client
[x86_64] MI2a: marked for install (shallow): python3-module-qrcode
[x86_64] MI2a: satisfying Depends: python3(PIL) < 0
[x86_64] MI2a: maybe install (a providing target): python3-module-Pillow 11.1.0-alt1:sisyphus+369514.100.1.1 at 1736863659
[x86_64] MI2a: target SELECTED: python3-module-Pillow 11.1.0-alt1:sisyphus+369514.100.1.1 at 1736863659
[x86_64] MI2a: requesting to install python3-module-Pillow (unspec'd ver; inspect with Debug::pkgMark-shallow)
[x86_64] MI2a: marked for install (shallow): python3-module-Pillow
[x86_64] MI2a: satisfying Depends: libfreetype.so.6()(64bit) >= set:lgzEJcLqTqgMRx1rQKEeTwp2c4r6iHbpvdcZluCgIojvvUZDqon3yNMm2lQtvhj2GlJR7Gr5
[x86_64] MI2a: maybe install (a providing target): libfreetype 2.13.3-alt1:sisyphus+355656.100.1.1 at 1724221064
[x86_64] MI2a: target SELECTED: libfreetype 2.13.3-alt1:sisyphus+355656.100.1.1 at 1724221064
[x86_64] MI2a: requesting to install libfreetype (unspec'd ver; inspect with Debug::pkgMark-shallow)
[x86_64] MI2a: marked for install (shallow): libfreetype
[x86_64] MI2a: satisfying PreDepends: libharfbuzz (NULL)
[x86_64] MI2a: maybe install (a direct target): libharfbuzz 11.0.0-alt1:sisyphus+379047.100.1.1 at 1742790848
[x86_64] MI2a: target SELECTED: libharfbuzz 11.0.0-alt1:sisyphus+379047.100.1.1 at 1742790848
[x86_64] MI2a: requesting to install libharfbuzz (unspec'd ver; inspect with Debug::pkgMark-shallow)
[x86_64] MI2a: marked for install (shallow): libharfbuzz
[x86_64] MI2a: satisfying Depends: libgraphite2.so.3()(64bit) >= set:kf32hGmUjq3tuKutzOJRzIQSHEyjposq2iEoszFE7SlOdnc
[x86_64] MI2a: maybe install (a providing target): libgraphite2 1.3.14-alt2.1:sisyphus+279571.100.1.2 at 1626605111
[x86_64] MI2a: target SELECTED: libgraphite2 1.3.14-alt2.1:sisyphus+279571.100.1.2 at 1626605111
[x86_64] MI2a: requesting to install libgraphite2 (unspec'd ver; inspect with Debug::pkgMark-shallow)
[x86_64] MI2a: marked for install (shallow): libgraphite2
[x86_64] MI2a: satisfying Depends: libpng16.so.16()(64bit) >= set:lgOKIQUxni0O7jHgjpNW6A1wpahp3UbHTCRKMJBuQNMRZ2RrxxTI5e42UDd
[x86_64] MI2a: maybe install (a providing target): libpng16 1.6.42-alt2:sisyphus+339555.100.1.1 at 1706781682
[x86_64] MI2a: target SELECTED: libpng16 1.6.42-alt2:sisyphus+339555.100.1.1 at 1706781682
[x86_64] MI2a: requesting to install libpng16 (unspec'd ver; inspect with Debug::pkgMark-shallow)
[x86_64] MI2a: marked for install (shallow): libpng16
[x86_64] MI2a: satisfying Depends: libimagequant.so.0()(64bit) >= set:jfQiWD0reiIxv6rvComO8RaS8Zte5C1
[x86_64] MI2a: maybe install (a providing target): libimagequant 2.17.0-alt1_1:sisyphus+291138.100.1.1 at 1638394107
[x86_64] MI2a: target SELECTED: libimagequant 2.17.0-alt1_1:sisyphus+291138.100.1.1 at 1638394107
[x86_64] MI2a: requesting to install libimagequant (unspec'd ver; inspect with Debug::pkgMark-shallow)
[x86_64] MI2a: marked for install (shallow): libimagequant
[x86_64] MI2a: satisfying Depends: libgomp.so.1()(64bit) >= set:mjKyty17U8lY1hIEgCsq
[x86_64] MI2a: maybe install (a providing target): libgomp1 14.2.1-alt1:sisyphus+360995.100.1.1 at 1730131018
[x86_64] MI2a: target SELECTED: libgomp1 14.2.1-alt1:sisyphus+360995.100.1.1 at 1730131018
[x86_64] MI2a: requesting to install libgomp1 (unspec'd ver; inspect with Debug::pkgMark-shallow)
[x86_64] MI2a: marked for install (shallow): libgomp1
[x86_64] MI2a: satisfying Depends: libjpeg.so.62()(64bit) >= set:kfjK3pSijy06F8ug3LI2kX8Z2n49ORaEUCr7g3p0oCl2VyGarIZB
[x86_64] MI2a: maybe install (a providing target): libjpeg 2:3.0.2-alt2.1:sisyphus+340135.100.1.1 at 1707449145
[x86_64] MI2a: target SELECTED: libjpeg 2:3.0.2-alt2.1:sisyphus+340135.100.1.1 at 1707449145
[x86_64] MI2a: requesting to install libjpeg (unspec'd ver; inspect with Debug::pkgMark-shallow)
[x86_64] MI2a: marked for install (shallow): libjpeg
[x86_64] MI2a: satisfying Depends: liblcms2.so.2()(64bit) >= set:mgZvFZxsCNIe0MXn5X6FmnE6A92HBDQaaox2i3FBvqsjIxiP8wqd4ErKZc3PTqllaXIZj7BBXjDOgE3wAWLZ7Z4MoV68tFBsWWM1
[x86_64] MI2a: maybe install (a providing target): liblcms2 2.17-alt1:sisyphus+374168.100.1.1 at 1739171632
[x86_64] MI2a: target SELECTED: liblcms2 2.17-alt1:sisyphus+374168.100.1.1 at 1739171632
[x86_64] MI2a: requesting to install liblcms2 (unspec'd ver; inspect with Debug::pkgMark-shallow)
[x86_64] MI2a: marked for install (shallow): liblcms2
[x86_64] MI2a: satisfying Depends: libopenjp2.so.7()(64bit) >= set:mh23ZD0KDN6cUVc92y7ak6kBlXl1KeSGVnvEYYFJUynpGsqtZwpo11Er0na0k86fZrhVI5Jj8ZazWFc
[x86_64] MI2a: maybe install (a providing target): libopenjpeg2.0 2.5.3-alt1:sisyphus+364601.100.1.1 at 1733825032
[x86_64] MI2a: target SELECTED: libopenjpeg2.0 2.5.3-alt1:sisyphus+364601.100.1.1 at 1733825032
[x86_64] MI2a: requesting to install libopenjpeg2.0 (unspec'd ver; inspect with Debug::pkgMark-shallow)
[x86_64] MI2a: marked for install (shallow): libopenjpeg2.0
[x86_64] MI2a: satisfying Depends: libtiff.so.5()(64bit) >= set:lg6uUwd1l7zrYCUEGw4LQiOb6ol1Z3pAu7Odg6k7X0rDsgZ6SOv092srP7wS3U8A51uM3nr8e5
[x86_64] MI2a: maybe install (a providing target): libtiff5 4.4.0-alt4:sisyphus+322581.100.1.2 at 1686180089
[x86_64] MI2a: target SELECTED: libtiff5 4.4.0-alt4:sisyphus+322581.100.1.2 at 1686180089
[x86_64] MI2a: requesting to install libtiff5 (unspec'd ver; inspect with Debug::pkgMark-shallow)
[x86_64] MI2a: marked for install (shallow): libtiff5
[x86_64] MI2a: satisfying Depends: libdeflate.so.0()(64bit) >= set:ifCEnhV7c75unfGi0p
[x86_64] MI2a: maybe install (a providing target): libdeflate 1.23-alt1:sisyphus+366443.100.2.1 at 1735140380
[x86_64] MI2a: target SELECTED: libdeflate 1.23-alt1:sisyphus+366443.100.2.1 at 1735140380
[x86_64] MI2a: requesting to install libdeflate (unspec'd ver; inspect with Debug::pkgMark-shallow)
[x86_64] MI2a: marked for install (shallow): libdeflate
[x86_64] MI2a: satisfying Depends: libwebp.so.7()(64bit) >= set:kg7NDsLBLaq98VOo9c870WF5YthYjXacU9
[x86_64] MI2a: maybe install (a providing target): libwebp7 1.5.0-alt1:sisyphus+365488.100.1.1 at 1734677703
[x86_64] MI2a: target SELECTED: libwebp7 1.5.0-alt1:sisyphus+365488.100.1.1 at 1734677703
[x86_64] MI2a: requesting to install libwebp7 (unspec'd ver; inspect with Debug::pkgMark-shallow)
[x86_64] MI2a: marked for install (shallow): libwebp7
[x86_64] MI2a: satisfying Depends: libxcb.so.1()(64bit) >= set:nj8Qaelsvk7Z3CisjcWpqA91cmMgsJrP1
[x86_64] MI2a: maybe install (a providing target): libxcb 1.17.0-alt1:sisyphus+345308.200.1.1 at 1713342004
[x86_64] MI2a: target SELECTED: libxcb 1.17.0-alt1:sisyphus+345308.200.1.1 at 1713342004
[x86_64] MI2a: requesting to install libxcb (unspec'd ver; inspect with Debug::pkgMark-shallow)
[x86_64] MI2a: marked for install (shallow): libxcb
[x86_64] MI2a: satisfying Depends: libXau.so.6()(64bit) >= set:ge34k81
[x86_64] MI2a: maybe install (a providing target): libXau 1.0.11-alt1:sisyphus+311428.100.1.1 at 1670577439
[x86_64] MI2a: target SELECTED: libXau 1.0.11-alt1:sisyphus+311428.100.1.1 at 1670577439
[x86_64] MI2a: requesting to install libXau (unspec'd ver; inspect with Debug::pkgMark-shallow)
[x86_64] MI2a: marked for install (shallow): libXau
[x86_64] MI2a: satisfying Depends: libXdmcp.so.6()(64bit) >= set:jiOzo
[x86_64] MI2a: maybe install (a providing target): libXdmcp 1.1.5-alt1:sisyphus+343583.700.1.1 at 1711441061
[x86_64] MI2a: target SELECTED: libXdmcp 1.1.5-alt1:sisyphus+343583.700.1.1 at 1711441061
[x86_64] MI2a: requesting to install libXdmcp (unspec'd ver; inspect with Debug::pkgMark-shallow)
[x86_64] MI2a: marked for install (shallow): libXdmcp
[x86_64] MI2a: satisfying Depends: python3(olefile) < 0
[x86_64] MI2a: maybe install (a providing target): python3-module-olefile 0.46-alt2:sisyphus+288126.100.1.1 at 1635163866
[x86_64] MI2a: target SELECTED: python3-module-olefile 0.46-alt2:sisyphus+288126.100.1.1 at 1635163866
[x86_64] MI2a: requesting to install python3-module-olefile (unspec'd ver; inspect with Debug::pkgMark-shallow)
[x86_64] MI2a: marked for install (shallow): python3-module-olefile
[x86_64] MI2a: marked for install (shallow): python3-module-samba
[x86_64] MI2a: satisfying Depends: libpytalloc-util.cpython-312.so.2()(64bit) >= set:hd5qVnZs9C0lXXAarCvfutiP
[x86_64] MI2a: maybe install (a providing target): python3-module-talloc 1:2.4.2-alt1:sisyphus+342425.200.8.1 at 1714749074
[x86_64] MI2a: target SELECTED: python3-module-talloc 1:2.4.2-alt1:sisyphus+342425.200.8.1 at 1714749074
[x86_64] MI2a: requesting to install python3-module-talloc (unspec'd ver; inspect with Debug::pkgMark-shallow)
[x86_64] MI2a: marked for install (shallow): python3-module-talloc
[x86_64] MI2a: satisfying Depends: python3(markdown) < 0
[x86_64] MI2a: maybe install (a providing target): python3-module-markdown 3.7-alt1:sisyphus+356078.100.1.1 at 1724670316
[x86_64] MI2a: target SELECTED: python3-module-markdown 3.7-alt1:sisyphus+356078.100.1.1 at 1724670316
[x86_64] MI2a: requesting to install python3-module-markdown (unspec'd ver; inspect with Debug::pkgMark-shallow)
[x86_64] MI2a: marked for install (shallow): python3-module-markdown
[x86_64] MI2a: satisfying Depends: python3-module-Pygments (NULL)
[x86_64] MI2a: maybe install (a direct target): python3-module-Pygments 2.19.1-alt1:sisyphus+368586.100.2.1 at 1737039695
[x86_64] MI2a: target SELECTED: python3-module-Pygments 2.19.1-alt1:sisyphus+368586.100.2.1 at 1737039695
[x86_64] MI2a: requesting to install python3-module-Pygments (unspec'd ver; inspect with Debug::pkgMark-shallow)
[x86_64] MI2a: marked for install (shallow): python3-module-Pygments
[x86_64] MI2a: satisfying Depends: python3-module-importlib-metadata >= 4.4
[x86_64] MI2a: maybe install (a direct target): python3-module-importlib-metadata 8.6.1-alt1:sisyphus+370687.100.1.1 at 1737451177
[x86_64] MI2a: target SELECTED: python3-module-importlib-metadata 8.6.1-alt1:sisyphus+370687.100.1.1 at 1737451177
[x86_64] MI2a: requesting to install python3-module-importlib-metadata (unspec'd ver; inspect with Debug::pkgMark-shallow)
[x86_64] MI2a: marked for install (shallow): python3-module-importlib-metadata
[x86_64] MI2a: satisfying Depends: python3-module-zipp (NULL)
[x86_64] MI2a: maybe install (a direct target): python3-module-zipp 3.21.0-alt1:sisyphus+362195.100.2.1 at 1731487934
[x86_64] MI2a: target SELECTED: python3-module-zipp 3.21.0-alt1:sisyphus+362195.100.2.1 at 1731487934
[x86_64] MI2a: requesting to install python3-module-zipp (unspec'd ver; inspect with Debug::pkgMark-shallow)
[x86_64] MI2a: marked for install (shallow): python3-module-zipp
[x86_64] MI2a: satisfying Depends: python3(tdb) < 0
[x86_64] MI2a: maybe install (a providing target): python3-module-tdb 1.4.12-alt1:sisyphus+380427.100.1.1 at 1743794605
[x86_64] MI2a: target SELECTED: python3-module-tdb 1.4.12-alt1:sisyphus+380427.100.1.1 at 1743794605
[x86_64] MI2a: requesting to install python3-module-tdb (unspec'd ver; inspect with Debug::pkgMark-shallow)
[x86_64] MI2a: marked for install (shallow): python3-module-tdb
[x86_64] MI2a: satisfying Depends: python3-module-pyldb = 4.21.4-alt1:sisyphus+380427.500.4.1
[x86_64] MI2a: maybe install (a direct target): python3-module-pyldb 4.21.4-alt1:sisyphus+380427.500.4.1 at 1743800937
[x86_64] MI2a: target SELECTED: python3-module-pyldb 4.21.4-alt1:sisyphus+380427.500.4.1 at 1743800937
[x86_64] MI2a: requesting to install python3-module-pyldb (unspec'd ver; inspect with Debug::pkgMark-shallow)
[x86_64] MI2a: marked for install (shallow): python3-module-pyldb
[x86_64] MI2a: satisfying Depends: samba = 4.21.4-alt1:sisyphus+380427.500.4.1
[x86_64] MI2a: maybe install (a direct target): samba 4.21.4-alt1:sisyphus+380427.500.4.1 at 1743800937
[x86_64] MI2a: target SELECTED: samba 4.21.4-alt1:sisyphus+380427.500.4.1 at 1743800937
[x86_64] MI2a: requesting to install samba (unspec'd ver; inspect with Debug::pkgMark-shallow)
[x86_64] MI2a: marked for install (shallow): samba
[x86_64] MI2a: satisfying Depends: tdb-utils (NULL)
[x86_64] MI2a: maybe install (a direct target): tdb-utils 1.4.12-alt1:sisyphus+380427.100.1.1 at 1743794605
[x86_64] MI2a: target SELECTED: tdb-utils 1.4.12-alt1:sisyphus+380427.100.1.1 at 1743794605
[x86_64] MI2a: requesting to install tdb-utils (unspec'd ver; inspect with Debug::pkgMark-shallow)
[x86_64] MI2a: marked for install (shallow): tdb-utils
[x86_64] MI2a: satisfying PreDepends: samba-common = 4.21.4-alt1:sisyphus+380427.500.4.1
[x86_64] MI2a: maybe install (a direct target): samba-common 4.21.4-alt1:sisyphus+380427.500.4.1 at 1743800937
[x86_64] MI2a: target SELECTED: samba-common 4.21.4-alt1:sisyphus+380427.500.4.1 at 1743800937
[x86_64] MI2a: requesting to install samba-common (unspec'd ver; inspect with Debug::pkgMark-shallow)
[x86_64] MI2a: marked for install (shallow): samba-common
[x86_64] MI2a: satisfying Depends: samba-common-client = 4.21.4-alt1:sisyphus+380427.500.4.1
[x86_64] MI2a: maybe install (a direct target): samba-common-client 4.21.4-alt1:sisyphus+380427.500.4.1 at 1743800937
[x86_64] MI2a: target SELECTED: samba-common-client 4.21.4-alt1:sisyphus+380427.500.4.1 at 1743800937
[x86_64] MI2a: requesting to install samba-common-client (unspec'd ver; inspect with Debug::pkgMark-shallow)
[x86_64] MI2a: marked for install (shallow): samba-common-client
[x86_64] MI2a: satisfying Depends: samba-dcerpc = 4.21.4-alt1:sisyphus+380427.500.4.1
[x86_64] MI2a: maybe install (a direct target): samba-dcerpc 4.21.4-alt1:sisyphus+380427.500.4.1 at 1743800937
[x86_64] MI2a: target SELECTED: samba-dcerpc 4.21.4-alt1:sisyphus+380427.500.4.1 at 1743800937
[x86_64] MI2a: requesting to install samba-dcerpc (unspec'd ver; inspect with Debug::pkgMark-shallow)
[x86_64] MI2a: marked for install (shallow): samba-dcerpc
[x86_64] MI2a: satisfying Depends: libcups.so.2()(64bit) >= set:nhz84HUyiawmK0eiNd60jwUK9vZIvS5I2wwyDjIOTZd0G2jKc0NrBB2rr9CG5s12WKQJ48J3GXMZl0ec9bwQX1Z9YU9k
[x86_64] MI2a: maybe install (a providing target): libcups 2.4.11-alt2:sisyphus+376849.100.1.1 at 1741104529
[x86_64] MI2a: target SELECTED: libcups 2.4.11-alt2:sisyphus+376849.100.1.1 at 1741104529
[x86_64] MI2a: requesting to install libcups (unspec'd ver; inspect with Debug::pkgMark-shallow)
[x86_64] MI2a: marked for install (shallow): libcups
[x86_64] MI2a: marked for install (shallow): chrony
[x86_64] MI2a: satisfying Depends: libedit.so.3()(64bit) >= set:li26UE2qtb5o6dVNmDaUI1
[x86_64] MI2a: maybe install (a providing target): libedit3 3.1.20230828-alt1:sisyphus+330914.200.3.1 at 1696922743
[x86_64] MI2a: target SELECTED: libedit3 3.1.20230828-alt1:sisyphus+330914.200.3.1 at 1696922743
[x86_64] MI2a: requesting to install libedit3 (unspec'd ver; inspect with Debug::pkgMark-shallow)
[x86_64] MI2a: marked for install (shallow): libedit3
[x86_64] MI2a: marked for install (shallow): softhsm
[x86_64] MI2a: satisfying Depends: libsofthsm = 2.6.1-alt3:sisyphus+343950.100.1.1
[x86_64] MI2a: maybe install (a direct target): libsofthsm 2.6.1-alt3:sisyphus+343950.100.1.1 at 1711730408
[x86_64] MI2a: target SELECTED: libsofthsm 2.6.1-alt3:sisyphus+343950.100.1.1 at 1711730408
[x86_64] MI2a: requesting to install libsofthsm (unspec'd ver; inspect with Debug::pkgMark-shallow)
[x86_64] MI2a: marked for install (shallow): libsofthsm
[x86_64] Starting
[x86_64] Starting 2
[x86_64] Investigating sssd 2.9.6-alt3:sisyphus+380427.1000.7.1 at 1743804358
[x86_64] Package sssd has a broken Depends: libldb = 2.10.0
[x86_64] Investigating python3-module-sss 2.9.6-alt3:sisyphus+380427.1000.7.1 at 1743804358
[x86_64] Package python3-module-sss has a broken Depends: sssd = 2.9.6-alt3:sisyphus+380427.1000.7.1
[x86_64] Considering sssd 2 as a solution to python3-module-sss 9999
[x86_64] Reinst(sssd) Need to fix this dep (or an alternative): Depends: libldb = 2.10.0
[x86_64] Reinst One of the alternatives failed early: Depends: libldb = 2.10.0
[x86_64] Reinst(sssd) All alternatives failed. So the whole current Reinst fails
[x86_64] Done
[x86_64] rpm-build-python3 is already the newest version.
[x86_64] Selected version libkrb5-devel#1.21.3-alt2:sisyphus+351857.100.1.1 at 1719735141 for libkrb5-devel>=1.16.3
[x86_64] Selected version libldap-devel#2.6.9-alt2:sisyphus+367501.300.4.1 at 1735841751 for openldap-devel>=2.4.47-alt2
[x86_64] rpm-macros-apache2 is already the newest version.
[x86_64] Selected version libsss_nss_idmap-devel#2.9.6-alt3:sisyphus+380427.1000.7.1 at 1743804358 for libsss_nss_idmap-devel>=2.7.0
[x86_64] Selected version 389-ds-base-devel#3.1.2-alt2:sisyphus+373095.200.3.1 at 1738752682 for 389-ds-base-devel>=2.1.0
[x86_64] Selected version samba-devel#4.21.4-alt1:sisyphus+380427.500.4.1 at 1743800937 for samba-devel>=4.7.6
[x86_64] Selecting node for 'nodejs'
[x86_64] Selecting python3-module-rjsmin for 'python3(rjsmin)'
[x86_64] Version python3-module-ldap#3.4.4-alt1:sisyphus+333513.67500.74.1 at 1704721072 for python3-module-ldap>=3.2.0 is already selected for install
[x86_64] Selecting python3-module-cryptography for 'python3(cryptography)'
[x86_64] Selecting python3-module-dbus for 'python3(dbus)'
[x86_64] Selecting python3-module-gssapi for 'python3(gssapi)'
[x86_64] Selecting python3-module-sss-murmur for 'python3(pysss_murmur)'
[x86_64] Selecting python3-module-lxml for 'python3(lxml)'
[x86_64] Selected version python3-module-dogtag-pki#11.4.3-alt5:sisyphus+373166.100.1.1 at 1738678390 for python3-module-pki-base>=10.10.5
[x86_64] Version python3-module-ldap#3.4.4-alt1:sisyphus+333513.67500.74.1 at 1704721072 for python3-module-ldap>=3.2.0 is already selected for install
[x86_64] Selecting python3-module-polib for 'python3(polib)'
[x86_64] Selecting python3-module-pytest for 'python3(pytest)'
[x86_64] Selecting python3-module-pytest-multihost for 'python3(pytest-multihost)'
[x86_64] Selected version python3-module-sssdconfig#2.9.6-alt3:sisyphus+380427.1000.7.1 at 1743804358 for python3-module-sssdconfig>=2.7.0
[x86_64] Selecting python3-module-ifaddr for 'python3(ifaddr)'
[x86_64] Selecting python3-module-jwcrypto for 'python3(jwcrypto)'
[x86_64] Selecting python3-module-augeas for 'python3(augeas)'
[x86_64] Selecting python3-modules-sqlite3 for 'python3(sqlite3)'
[x86_64] Selecting python3-module-pexpect for 'python3(pexpect)'
[x86_64] Selecting python3-module-psutil for 'python3(psutil)'
[x86_64] Selecting python3-module-netaddr for 'python3(netaddr)'
[x86_64] Selecting python3-module-jinja2 for 'python3(jinja2)'
[x86_64] Selecting python3-module-pyasn1 for 'python3(pyasn1)'
[x86_64] Selecting python3-module-pyasn1-modules for 'python3(pyasn1_modules)'
[x86_64] Selecting python3-module-sss_nss_idmap for 'python3(pysss_nss_idmap)'
[x86_64] Selecting python3-module-yubico for 'python3(yubico)'
[x86_64] Selecting python3-module-requests for 'python3(requests)'
[x86_64] Version python3-module-urllib3#2:2.3.0-alt1:sisyphus+366320.100.2.1 at 1735116352 for python3-module-urllib3>=1.26.8 is already selected for install
[x86_64] Selecting python3-module-dateutil for 'python3(dateutil)'
[x86_64] Selecting python3-module-dns for 'python3(dns)'
[x86_64] Selecting python3-module-ipa_hbac for 'python3(pyhbac)'
[x86_64] Selecting python3-module-yaml for 'python3(yaml)'
[x86_64] Selecting python3-module-systemd for 'python3(systemd)'
[x86_64] Selecting python3-module-sss for 'python3(pysss)'
[x86_64] Selecting python3-module-pytest_sourceorder for 'python3(pytest_sourceorder)'
[x86_64] Version python3-module-lib389#3.1.2-alt2:sisyphus+373095.200.3.1 at 1738752682 for python3-module-lib389>=2.1.0 is already selected for install
[x86_64] Selecting python3-module-qrcode for 'python3(qrcode)'
[x86_64] Some packages could not be installed. This may mean that you have
[x86_64] requested an impossible situation or if you are using the unstable
[x86_64] distribution that some required packages have not yet been created
[x86_64] or been moved out of Incoming.
[x86_64] The following information may help to resolve the situation:
[x86_64]
[x86_64] The following packages have unmet dependencies:
[x86_64] python3-module-sss: Depends: sssd (= 2.9.6-alt3:sisyphus+380427.1000.7.1)
[x86_64] E: Broken packages
[x86_64] hsh-install: Failed to calculate package file list.
[x86_64] hsh-install: Failed to generate package file list.
2025-Apr-04 22:10:42 :: [x86_64] freeipa.git 4.12.3-alt2: remote: cannot build src.rpm
2025-Apr-04 22:10:42 :: [x86_64] #1400 freeipa.git 4.12.3-alt2: build FAILED
2025-Apr-04 22:10:42 :: [x86_64] requesting cancellation of task processing
2025-Apr-04 22:11:21 :: [i586] #1300 admc.git 0.20.0-alt1: build OK
2025-Apr-04 22:11:22 :: [i586] task processing CANCELLED
2025-Apr-04 22:11:27 :: [aarch64] #1000 sssd.git 2.9.6-alt3: build OK
2025-Apr-04 22:11:27 :: [aarch64] task processing CANCELLED
2025-Apr-04 22:10:42 :: [x86_64] build FAILED
2025-Apr-04 22:11:22 :: [i586] build FAILED
2025-Apr-04 22:11:27 :: [aarch64] build FAILED
2025-Apr-04 22:11:27 :: task #380427 for sisyphus FAILED
More information about the Sisyphus-incominger
mailing list