[#380422] [test-only] FAILED dufs.git=0.43.0-alt1

Girar awaiter (vt) girar-builder at altlinux.org
Fri Apr 4 18:43:16 MSK 2025


https://git.altlinux.org/tasks/380422/logs/events.1.1.log
https://packages.altlinux.org/tasks/380422

subtask  name  aarch64    i586  x86_64
   #100  dufs   failed  failed  failed

2025-Apr-04 15:39:38 :: test-only task #380422 for sisyphus started by vt:
#100 build 0.43.0-alt1 from /people/vt/packages/dufs.git fetched at 2025-Apr-04 15:39:37
2025-Apr-04 15:39:39 :: [x86_64] #100 dufs.git 0.43.0-alt1: build start
2025-Apr-04 15:39:39 :: [i586] #100 dufs.git 0.43.0-alt1: build start
2025-Apr-04 15:39:39 :: [aarch64] #100 dufs.git 0.43.0-alt1: build start
[x86_64] + target/release/dufs --completions zsh
[x86_64] /usr/src/tmp/rpm-tmp.89874: line 128: /usr/src/tmp/dufs-buildroot/usr/share/zsh/site-functions/_dufs: No such file or directory
2025-Apr-04 15:41:34 :: [x86_64] dufs.git 0.43.0-alt1: remote: build failed
2025-Apr-04 15:41:34 :: [x86_64] #100 dufs.git 0.43.0-alt1: build FAILED
2025-Apr-04 15:41:34 :: [x86_64] requesting cancellation of task processing
[i586] + target/release/dufs --completions zsh
[i586] /usr/src/tmp/rpm-tmp.46048: line 128: /usr/src/tmp/dufs-buildroot/usr/share/zsh/site-functions/_dufs: No such file or directory
2025-Apr-04 15:41:55 :: [i586] dufs.git 0.43.0-alt1: remote: build failed
2025-Apr-04 15:41:55 :: [i586] #100 dufs.git 0.43.0-alt1: build FAILED
[aarch64] + target/release/dufs --completions zsh
[aarch64] /usr/src/tmp/rpm-tmp.51661: line 128: /usr/src/tmp/dufs-buildroot/usr/share/zsh/site-functions/_dufs: No such file or directory
2025-Apr-04 15:43:16 :: [aarch64] dufs.git 0.43.0-alt1: remote: build failed
2025-Apr-04 15:43:16 :: [aarch64] #100 dufs.git 0.43.0-alt1: build FAILED
2025-Apr-04 15:41:34 :: [x86_64] build FAILED
2025-Apr-04 15:41:55 :: [i586] build FAILED
2025-Apr-04 15:43:16 :: [aarch64] build FAILED
2025-Apr-04 15:43:16 :: task #380422 for sisyphus FAILED


More information about the Sisyphus-incominger mailing list