[#380033] [test-only] FAILED (try 2) python3-module-aiohttp-asgi.git=0.5.2-alt2 ...
Girar awaiter (dutyrok)
girar-builder at altlinux.org
Wed Apr 2 18:13:51 MSK 2025
https://git.altlinux.org/tasks/380033/logs/events.2.1.log
https://packages.altlinux.org/tasks/380033
subtask name aarch64 i586 x86_64
#200 python3-module-aiomisc 54 28 29
#300 python3-module-aiomisc-pytest 47 26 27
#400 python3-module-caio ? 42 41
#500 python3-module-aiofile ? failed failed
2025-Apr-02 15:11:27 :: test-only task #380033 for sisyphus resumed by dutyrok:
#100 build 0.5.2-alt2 from /people/dutyrok/packages/python3-module-aiohttp-asgi.git fetched at 2025-Apr-02 14:50:13
#200 build 17.7.7-alt1 from /people/dutyrok/packages/python3-module-aiomisc.git fetched at 2025-Apr-02 14:51:36
#300 build 1.2.1-alt1 from /people/dutyrok/packages/python3-module-aiomisc-pytest.git fetched at 2025-Apr-02 14:52:56
#400 build 0.9.21-alt1 from /people/dutyrok/packages/python3-module-caio.git fetched at 2025-Apr-02 14:53:46
#500 build 3.9.0-alt1 from /people/dutyrok/packages/python3-module-aiofile.git fetched at 2025-Apr-02 14:55:07
#540 build 0.1.4-alt1.git0c6accc5 from /people/dutyrok/packages/python3-module-forbiddenfruit.git fetched at 2025-Apr-02 15:03:32
#600 build 1.5.23-alt1 from /people/dutyrok/packages/python3-module-blockbuster.git fetched at 2025-Apr-02 14:57:22
#700 removed
#1000 build 4.9.0-alt1 from /people/dutyrok/packages/python3-module-anyio.git fetched at 2025-Apr-02 15:10:05
2025-Apr-02 15:11:28 :: created build repo
2025-Apr-02 15:11:29 :: [i586] #100 python3-module-aiohttp-asgi.git 0.5.2-alt2: build start
2025-Apr-02 15:11:29 :: [x86_64] #100 python3-module-aiohttp-asgi.git 0.5.2-alt2: build start
2025-Apr-02 15:11:29 :: [aarch64] #100 python3-module-aiohttp-asgi.git 0.5.2-alt2: build start
2025-Apr-02 15:11:47 :: [i586] #100 python3-module-aiohttp-asgi.git 0.5.2-alt2: build OK (cached)
2025-Apr-02 15:11:47 :: [i586] #200 python3-module-aiomisc.git 17.7.7-alt1: build start
2025-Apr-02 15:11:48 :: [x86_64] #100 python3-module-aiohttp-asgi.git 0.5.2-alt2: build OK (cached)
2025-Apr-02 15:11:48 :: [x86_64] #200 python3-module-aiomisc.git 17.7.7-alt1: build start
2025-Apr-02 15:12:09 :: [aarch64] #100 python3-module-aiohttp-asgi.git 0.5.2-alt2: build OK (cached)
2025-Apr-02 15:12:09 :: [aarch64] #200 python3-module-aiomisc.git 17.7.7-alt1: build start
2025-Apr-02 15:12:15 :: [i586] #200 python3-module-aiomisc.git 17.7.7-alt1: build OK
2025-Apr-02 15:12:15 :: [i586] #300 python3-module-aiomisc-pytest.git 1.2.1-alt1: build start
2025-Apr-02 15:12:17 :: [x86_64] #200 python3-module-aiomisc.git 17.7.7-alt1: build OK
2025-Apr-02 15:12:17 :: [x86_64] #300 python3-module-aiomisc-pytest.git 1.2.1-alt1: build start
2025-Apr-02 15:12:41 :: [i586] #300 python3-module-aiomisc-pytest.git 1.2.1-alt1: build OK
2025-Apr-02 15:12:41 :: [i586] #400 python3-module-caio.git 0.9.21-alt1: build start
2025-Apr-02 15:12:44 :: [x86_64] #300 python3-module-aiomisc-pytest.git 1.2.1-alt1: build OK
2025-Apr-02 15:12:44 :: [x86_64] #400 python3-module-caio.git 0.9.21-alt1: build start
2025-Apr-02 15:13:03 :: [aarch64] #200 python3-module-aiomisc.git 17.7.7-alt1: build OK
2025-Apr-02 15:13:03 :: [aarch64] #300 python3-module-aiomisc-pytest.git 1.2.1-alt1: build start
2025-Apr-02 15:13:23 :: [i586] #400 python3-module-caio.git 0.9.21-alt1: build OK
2025-Apr-02 15:13:23 :: [i586] #500 python3-module-aiofile.git 3.9.0-alt1: build start
2025-Apr-02 15:13:25 :: [x86_64] #400 python3-module-caio.git 0.9.21-alt1: build OK
2025-Apr-02 15:13:25 :: [x86_64] #500 python3-module-aiofile.git 3.9.0-alt1: build start
[i586] <13>Apr 2 15:13:35 rpmi: libmpdec3-2.5.1-alt3 sisyphus+314490.500.5.1 1675432033 installed
[i586] <13>Apr 2 15:13:36 rpmi: libgdbm-1.8.3-alt10 sisyphus+346222.200.3.2 1716468406 installed
[i586] <13>Apr 2 15:13:36 rpmi: libexpat-2.7.1-alt1 sisyphus+379929.100.1.1 1743519386 installed
[i586] <13>Apr 2 15:13:36 rpmi: openssl-config-3.2.0-alt1 sisyphus+366659.140.4.1 1736956949 installed
[i586] <13>Apr 2 15:13:36 rpmi: libb2-0.98.1-alt1_1 sisyphus+291614.100.1.1 1638962878 installed
[i586] <13>Apr 2 15:13:36 rpmi: libp11-kit-1:0.25.5-alt1 sisyphus+352553.100.1.1 1720622586 installed
[i586] <13>Apr 2 15:13:36 rpmi: libtasn1-4.20.0-alt2 sisyphus+375829.100.1.1 1740299335 installed
[i586] <13>Apr 2 15:13:36 rpmi: rpm-macros-alternatives-0.5.3-alt1 sisyphus+371878.100.1.1 1737988822 installed
[i586] <13>Apr 2 15:13:36 rpmi: alternatives-0.5.3-alt1 sisyphus+371878.100.1.1 1737988822 installed
[i586] <13>Apr 2 15:13:36 rpmi: ca-certificates-2025.02.10-alt1 sisyphus+374228.100.4.1 1739265441 installed
[i586] <13>Apr 2 15:13:36 rpmi: ca-trust-0.2.0-alt1 sisyphus+344843.100.1.1 1712743326 installed
[i586] <13>Apr 2 15:13:36 rpmi: p11-kit-trust-1:0.25.5-alt1 sisyphus+352553.100.1.1 1720622586 installed
[i586] <13>Apr 2 15:13:36 rpmi: libcrypto3-3.3.3-alt1 sisyphus+374381.40.2.1 1739299702 installed
[i586] <13>Apr 2 15:13:36 rpmi: libssl3-3.3.3-alt1 sisyphus+374381.40.2.1 1739299702 installed
[i586] <13>Apr 2 15:13:36 rpmi: python3-3.12.9-alt1 sisyphus+376344.100.1.1 1740742068 installed
[i586] <13>Apr 2 15:13:36 rpmi: python3-base-3.12.9-alt1 sisyphus+376344.100.1.1 1740742068 installed
[i586] <13>Apr 2 15:13:36 rpmi: python3-module-py3dephell-0.3.1-alt1 sisyphus+365261.200.1.1 1734463433 installed
[i586] <13>Apr 2 15:13:36 rpmi: python3-module-pyproject-installer-0.5.5-alt2 sisyphus+366395.100.1.1 1735032014 installed
[i586] <13>Apr 2 15:13:36 rpmi: rpm-macros-pyproject-0.0.9-alt1 sisyphus+362541.300.2.1 1731671840 installed
[i586] <13>Apr 2 15:13:36 rpmi: tests-for-installed-python3-pkgs-0.1.28-alt1 sisyphus+375953.100.2.1 1740855713 installed
[i586] <13>Apr 2 15:13:36 rpmi: rpm-build-python3-0.1.28-alt1 sisyphus+375953.100.2.1 1740855713 installed
[i586] <13>Apr 2 15:13:36 rpmi: rpm-build-pyproject-0.0.9-alt1 sisyphus+362541.300.2.1 1731671840 installed
[i586] Reading Package Lists...
[i586] Building Dependency Tree...
[i586] MI2a: marked for install (shallow): python3-module-poetry-core
[i586] MI2a: satisfying Depends: python3(poetry) < 0
[i586] MI2a: maybe install (a providing target): python3-module-poetry-alt-namespace 0.0.1-alt1:sisyphus+306728.100.1.1 at 1663083685
[i586] MI2a: target SELECTED: python3-module-poetry-alt-namespace 0.0.1-alt1:sisyphus+306728.100.1.1 at 1663083685
[i586] MI2a: requesting to install python3-module-poetry-alt-namespace (unspec'd ver; inspect with Debug::pkgMark-shallow)
[i586] MI2a: marked for install (shallow): python3-module-poetry-alt-namespace
[i586] MI2a: satisfying Depends: python3-module-fastjsonschema (NULL)
[i586] MI2a: maybe install (a direct target): python3-module-fastjsonschema 2.21.1-alt1:sisyphus+363956.100.1.1 at 1733217943
[i586] MI2a: target SELECTED: python3-module-fastjsonschema 2.21.1-alt1:sisyphus+363956.100.1.1 at 1733217943
[i586] MI2a: requesting to install python3-module-fastjsonschema (unspec'd ver; inspect with Debug::pkgMark-shallow)
[i586] MI2a: marked for install (shallow): python3-module-fastjsonschema
[i586] MI2a: satisfying Depends: python3-module-lark (NULL)
[i586] MI2a: maybe install (a direct target): python3-module-lark 1.2.2-alt1:sisyphus+358322.100.1.1 at 1727258177
[i586] MI2a: target SELECTED: python3-module-lark 1.2.2-alt1:sisyphus+358322.100.1.1 at 1727258177
[i586] MI2a: requesting to install python3-module-lark (unspec'd ver; inspect with Debug::pkgMark-shallow)
[i586] MI2a: marked for install (shallow): python3-module-lark
[i586] MI2a: satisfying Depends: python3-module-packaging (NULL)
[i586] MI2a: maybe install (a direct target): python3-module-packaging 24.2-alt1:sisyphus+362183.100.1.1 at 1731315992
[i586] MI2a: target SELECTED: python3-module-packaging 24.2-alt1:sisyphus+362183.100.1.1 at 1731315992
[i586] MI2a: requesting to install python3-module-packaging (unspec'd ver; inspect with Debug::pkgMark-shallow)
[i586] MI2a: marked for install (shallow): python3-module-packaging
[i586] MI2a: satisfying Depends: python3-module-tomli (NULL)
[i586] MI2a: maybe install (a direct target): python3-module-tomli 2.2.1-alt1:sisyphus+363592.100.1.1 at 1732803942
[i586] MI2a: target SELECTED: python3-module-tomli 2.2.1-alt1:sisyphus+363592.100.1.1 at 1732803942
[i586] MI2a: requesting to install python3-module-tomli (unspec'd ver; inspect with Debug::pkgMark-shallow)
[i586] MI2a: marked for install (shallow): python3-module-tomli
[i586] MI2a: marked for install (shallow): python3-module-aiomisc-pytest
[i586] MI2a: satisfying Depends: python3-module-aiomisc (NULL)
[i586] MI2a: maybe install (a direct target): python3-module-aiomisc 17.7.7-alt1:sisyphus+380033.200.2.1 at 1743606733
[i586] MI2a: target SELECTED: python3-module-aiomisc 17.7.7-alt1:sisyphus+380033.200.2.1 at 1743606733
[i586] MI2a: requesting to install python3-module-aiomisc (unspec'd ver; inspect with Debug::pkgMark-shallow)
[i586] MI2a: marked for install (shallow): python3-module-aiomisc
[i586] MI2a: satisfying Depends: python3-module-colorlog (NULL)
[i586] MI2a: maybe install (a direct target): python3-module-colorlog 6.9.0-alt1:sisyphus+361147.100.1.1 at 1730276596
[i586] MI2a: target SELECTED: python3-module-colorlog 6.9.0-alt1:sisyphus+361147.100.1.1 at 1730276596
[i586] MI2a: requesting to install python3-module-colorlog (unspec'd ver; inspect with Debug::pkgMark-shallow)
[i586] MI2a: marked for install (shallow): python3-module-colorlog
[i586] MI2a: satisfying Depends: python3-module-logging-journald (NULL)
[i586] MI2a: maybe install (a direct target): python3-module-logging-journald 0.6.11-alt1:sisyphus+379065.100.1.1 at 1742804085
[i586] MI2a: target SELECTED: python3-module-logging-journald 0.6.11-alt1:sisyphus+379065.100.1.1 at 1742804085
[i586] MI2a: requesting to install python3-module-logging-journald (unspec'd ver; inspect with Debug::pkgMark-shallow)
[i586] MI2a: marked for install (shallow): python3-module-logging-journald
[i586] MI2a: satisfying Depends: python3(aiocarbon.protocol.pickle) < 0
[i586] MI2a: maybe install (a providing target): python3-module-aiocarbon 0.15.3-alt1:sisyphus+330385.200.1.1 at 1695726415
[i586] MI2a: target SELECTED: python3-module-aiocarbon 0.15.3-alt1:sisyphus+330385.200.1.1 at 1695726415
[i586] MI2a: requesting to install python3-module-aiocarbon (unspec'd ver; inspect with Debug::pkgMark-shallow)
[i586] MI2a: marked for install (shallow): python3-module-aiocarbon
[i586] MI2a: satisfying Depends: python3-module-immutables (NULL)
[i586] MI2a: maybe install (a direct target): python3-module-immutables 0.20-alt1:sisyphus+333513.74200.74.1 at 1704727699
[i586] MI2a: target SELECTED: python3-module-immutables 0.20-alt1:sisyphus+333513.74200.74.1 at 1704727699
[i586] MI2a: requesting to install python3-module-immutables (unspec'd ver; inspect with Debug::pkgMark-shallow)
[i586] MI2a: marked for install (shallow): python3-module-immutables
[i586] MI2a: satisfying Depends: python3(aiohttp) < 0
[i586] MI2a: maybe install (a providing target): python3-module-aiohttp 3.11.13-alt1:sisyphus+377836.100.1.1 at 1741868193
[i586] MI2a: target SELECTED: python3-module-aiohttp 3.11.13-alt1:sisyphus+377836.100.1.1 at 1741868193
[i586] MI2a: requesting to install python3-module-aiohttp (unspec'd ver; inspect with Debug::pkgMark-shallow)
[i586] MI2a: marked for install (shallow): python3-module-aiohttp
[i586] MI2a: satisfying Depends: python3(aiohappyeyeballs) < 0
[i586] MI2a: maybe install (a providing target): python3-module-aiohappyeyeballs 2.4.4-alt1:sisyphus+369620.100.1.1 at 1736938218
[i586] MI2a: target SELECTED: python3-module-aiohappyeyeballs 2.4.4-alt1:sisyphus+369620.100.1.1 at 1736938218
[i586] MI2a: requesting to install python3-module-aiohappyeyeballs (unspec'd ver; inspect with Debug::pkgMark-shallow)
[i586] MI2a: marked for install (shallow): python3-module-aiohappyeyeballs
[i586] MI2a: satisfying Depends: python3(aiosignal) < 0
[i586] MI2a: maybe install (a providing target): python3-module-aiosignal 1.3.2-alt1:sisyphus+369480.100.1.1 at 1736854528
[i586] MI2a: target SELECTED: python3-module-aiosignal 1.3.2-alt1:sisyphus+369480.100.1.1 at 1736854528
[i586] MI2a: requesting to install python3-module-aiosignal (unspec'd ver; inspect with Debug::pkgMark-shallow)
[i586] MI2a: marked for install (shallow): python3-module-aiosignal
[i586] MI2a: satisfying Depends: python3(frozenlist) < 0
[i586] MI2a: maybe install (a providing target): python3-module-frozenlist 1.5.0-alt1:sisyphus+362047.100.1.1 at 1731079174
[i586] MI2a: target SELECTED: python3-module-frozenlist 1.5.0-alt1:sisyphus+362047.100.1.1 at 1731079174
[i586] MI2a: requesting to install python3-module-frozenlist (unspec'd ver; inspect with Debug::pkgMark-shallow)
[i586] MI2a: marked for install (shallow): python3-module-frozenlist
[i586] MI2a: satisfying Depends: python3(attr) < 0
[i586] MI2a: maybe install (a providing target): python3-module-attrs 25.3.0-alt1:sisyphus+378700.100.1.1 at 1742472992
[i586] MI2a: target SELECTED: python3-module-attrs 25.3.0-alt1:sisyphus+378700.100.1.1 at 1742472992
[i586] MI2a: requesting to install python3-module-attrs (unspec'd ver; inspect with Debug::pkgMark-shallow)
[i586] MI2a: marked for install (shallow): python3-module-attrs
[i586] MI2a: satisfying Depends: python3(gunicorn.config) < 0
[i586] MI2a: maybe install (a providing target): python3-module-gunicorn 23.0.0-alt1:sisyphus+362920.200.1.1 at 1732021917
[i586] MI2a: target SELECTED: python3-module-gunicorn 23.0.0-alt1:sisyphus+362920.200.1.1 at 1732021917
[i586] MI2a: requesting to install python3-module-gunicorn (unspec'd ver; inspect with Debug::pkgMark-shallow)
[i586] MI2a: marked for install (shallow): python3-module-gunicorn
[i586] MI2a: satisfying Depends: python3(eventlet) < 0
[i586] MI2a: maybe install (a providing target): python3-module-eventlet 0.39.1-alt1:sisyphus+377102.100.1.1 at 1741275965
[i586] MI2a: target SELECTED: python3-module-eventlet 0.39.1-alt1:sisyphus+377102.100.1.1 at 1741275965
[i586] MI2a: requesting to install python3-module-eventlet (unspec'd ver; inspect with Debug::pkgMark-shallow)
[i586] MI2a: marked for install (shallow): python3-module-eventlet
[i586] MI2a: satisfying Depends: python3-module-dns (NULL)
[i586] MI2a: maybe install (a direct target): python3-module-dns 1:2.6.1-alt1:sisyphus+341811.20.3.1 at 1709382170
[i586] MI2a: target SELECTED: python3-module-dns 1:2.6.1-alt1:sisyphus+341811.20.3.1 at 1709382170
[i586] MI2a: requesting to install python3-module-dns (unspec'd ver; inspect with Debug::pkgMark-shallow)
[i586] MI2a: marked for install (shallow): python3-module-dns
[i586] MI2a: satisfying Depends: python3(cryptography.hazmat.backends) < 0
[i586] MI2a: maybe install (a providing target): python3-module-cryptography 44.0.0-alt1:sisyphus+368451.100.1.1 at 1736436014
[i586] MI2a: target SELECTED: python3-module-cryptography 44.0.0-alt1:sisyphus+368451.100.1.1 at 1736436014
[i586] MI2a: requesting to install python3-module-cryptography (unspec'd ver; inspect with Debug::pkgMark-shallow)
[i586] MI2a: marked for install (shallow): python3-module-cryptography
[i586] MI2a: satisfying Depends: python3(cffi) < 0
[i586] MI2a: maybe install (a providing target): python3-module-cffi 1.17.1-alt1:sisyphus+357396.100.1.1 at 1726156488
[i586] MI2a: target SELECTED: python3-module-cffi 1.17.1-alt1:sisyphus+357396.100.1.1 at 1726156488
[i586] MI2a: requesting to install python3-module-cffi (unspec'd ver; inspect with Debug::pkgMark-shallow)
[i586] MI2a: marked for install (shallow): python3-module-cffi
[i586] MI2a: satisfying Depends: python3-module-pycparser (NULL)
[i586] MI2a: maybe install (a direct target): python3-module-pycparser 2.22-alt1:sisyphus+378485.100.1.1 at 1742331206
[i586] MI2a: target SELECTED: python3-module-pycparser 2.22-alt1:sisyphus+378485.100.1.1 at 1742331206
[i586] MI2a: requesting to install python3-module-pycparser (unspec'd ver; inspect with Debug::pkgMark-shallow)
[i586] MI2a: marked for install (shallow): python3-module-pycparser
[i586] MI2a: satisfying Depends: python3(trio) < 0
[i586] MI2a: maybe install (a providing target): python3-module-trio 0.29.0-alt1:sisyphus+376073.100.1.1 at 1740492646
[i586] MI2a: target SELECTED: python3-module-trio 0.29.0-alt1:sisyphus+376073.100.1.1 at 1740492646
[i586] MI2a: requesting to install python3-module-trio (unspec'd ver; inspect with Debug::pkgMark-shallow)
[i586] MI2a: marked for install (shallow): python3-module-trio
[i586] MI2a: satisfying Depends: python3(astor) < 0
[i586] MI2a: maybe install (a providing target): python3-module-astor 0.8.1-alt1.1:sisyphus+315877.100.1.1 at 1677481862
[i586] MI2a: target SELECTED: python3-module-astor 0.8.1-alt1.1:sisyphus+315877.100.1.1 at 1677481862
[i586] MI2a: requesting to install python3-module-astor (unspec'd ver; inspect with Debug::pkgMark-shallow)
[i586] MI2a: marked for install (shallow): python3-module-astor
[i586] MI2a: satisfying Depends: python3(idna) < 0
[i586] MI2a: maybe install (a providing target): python3-module-idna 3.10-alt1:sisyphus+358681.100.1.1 at 1727701241
[i586] MI2a: target SELECTED: python3-module-idna 3.10-alt1:sisyphus+358681.100.1.1 at 1727701241
[i586] MI2a: requesting to install python3-module-idna (unspec'd ver; inspect with Debug::pkgMark-shallow)
[i586] MI2a: marked for install (shallow): python3-module-idna
[i586] MI2a: satisfying Depends: python3(outcome) < 0
[i586] MI2a: maybe install (a providing target): python3-module-outcome 1.3.0-alt1:sisyphus+332382.100.1.1 at 1697882349
[i586] MI2a: target SELECTED: python3-module-outcome 1.3.0-alt1:sisyphus+332382.100.1.1 at 1697882349
[i586] MI2a: requesting to install python3-module-outcome (unspec'd ver; inspect with Debug::pkgMark-shallow)
[i586] MI2a: marked for install (shallow): python3-module-outcome
[i586] MI2a: satisfying Depends: python3(sniffio) < 0
[i586] MI2a: maybe install (a providing target): python3-module-sniffio 1.3.1-alt1:sisyphus+341424.100.1.1 at 1708941879
[i586] MI2a: target SELECTED: python3-module-sniffio 1.3.1-alt1:sisyphus+341424.100.1.1 at 1708941879
[i586] MI2a: requesting to install python3-module-sniffio (unspec'd ver; inspect with Debug::pkgMark-shallow)
[i586] MI2a: marked for install (shallow): python3-module-sniffio
[i586] MI2a: satisfying Depends: python3(sortedcontainers) < 0
[i586] MI2a: maybe install (a providing target): python3-module-sortedcontainers 2.4.0-alt1:sisyphus+272042.100.1.1 at 1621262424
[i586] MI2a: target SELECTED: python3-module-sortedcontainers 2.4.0-alt1:sisyphus+272042.100.1.1 at 1621262424
[i586] MI2a: requesting to install python3-module-sortedcontainers (unspec'd ver; inspect with Debug::pkgMark-shallow)
[i586] MI2a: marked for install (shallow): python3-module-sortedcontainers
[i586] MI2a: satisfying Depends: python3-module-greenlet (NULL)
[i586] MI2a: maybe install (a direct target): python3-module-greenlet 3.1.1-alt1:sisyphus+358881.100.1.1 at 1727933146
[i586] MI2a: target SELECTED: python3-module-greenlet 3.1.1-alt1:sisyphus+358881.100.1.1 at 1727933146
[i586] MI2a: requesting to install python3-module-greenlet (unspec'd ver; inspect with Debug::pkgMark-shallow)
[i586] MI2a: marked for install (shallow): python3-module-greenlet
[i586] MI2a: satisfying Depends: python3(objgraph) < 0
[i586] MI2a: maybe install (a providing target): python3-module-objgraph 3.6.2-alt1:sisyphus+359468.100.1.1 at 1728573508
[i586] MI2a: target SELECTED: python3-module-objgraph 3.6.2-alt1:sisyphus+359468.100.1.1 at 1728573508
[i586] MI2a: requesting to install python3-module-objgraph (unspec'd ver; inspect with Debug::pkgMark-shallow)
[i586] MI2a: marked for install (shallow): python3-module-objgraph
[i586] MI2a: satisfying Depends: python3(psutil) < 0
[i586] MI2a: maybe install (a providing target): python3-module-psutil 7.0.0-alt1:sisyphus+378483.100.1.1 at 1742330008
[i586] MI2a: target SELECTED: python3-module-psutil 7.0.0-alt1:sisyphus+378483.100.1.1 at 1742330008
[i586] MI2a: requesting to install python3-module-psutil (unspec'd ver; inspect with Debug::pkgMark-shallow)
[i586] MI2a: marked for install (shallow): python3-module-psutil
[i586] MI2a: satisfying Depends: python3(OpenSSL) < 0
[i586] MI2a: maybe install (a providing target): python3-module-openssl 24.3.0-alt1:sisyphus+368451.200.1.1 at 1736436083
[i586] MI2a: target SELECTED: python3-module-openssl 24.3.0-alt1:sisyphus+368451.200.1.1 at 1736436083
[i586] MI2a: requesting to install python3-module-openssl (unspec'd ver; inspect with Debug::pkgMark-shallow)
[i586] MI2a: marked for install (shallow): python3-module-openssl
[i586] MI2a: satisfying Depends: python3(psycopg2) < 0
[i586] MI2a: maybe install (a providing target): python3-module-psycopg2 2.9.10-alt1:sisyphus+361099.100.1.1 at 1730221779
[i586] MI2a: target SELECTED: python3-module-psycopg2 2.9.10-alt1:sisyphus+361099.100.1.1 at 1730221779
[i586] MI2a: requesting to install python3-module-psycopg2 (unspec'd ver; inspect with Debug::pkgMark-shallow)
[i586] MI2a: marked for install (shallow): python3-module-psycopg2
[i586] MI2a: satisfying Depends: libpq.so.5 >= set:le0TVGKd0aLPs2Nto7Z1f8FxU3t37565zOwtmwlUaqXXOK7GBJfWweelDqOjusm7LJHI69oPyonkICCi7Hi78n4deWgL0M4UUqqo39mMeelHELjE5yi3qLNMnCZ060roZ0PZcpSmWdyMwKwETwhIPQUDbMdEicljufQaexcjaai71ZcKRhi1LXSb1
[i586] MI2a: maybe install (a providing target): libpq5-17 17.4-alt2:sisyphus+379856.100.1.1 at 1743493317
[i586] MI2a: target SELECTED: libpq5-17 17.4-alt2:sisyphus+379856.100.1.1 at 1743493317
[i586] MI2a: requesting to install libpq5-17 (unspec'd ver; inspect with Debug::pkgMark-shallow)
[i586] MI2a: marked for install (shallow): libpq5-17
[i586] MI2a: satisfying Depends: libgssapi_krb5.so.2 >= set:lherpSlTiIbj9ttXyZebz97L79n5wNyJos
[i586] MI2a: maybe install (a providing target): libkrb5 1.21.3-alt2:sisyphus+351857.100.1.1 at 1719735219
[i586] MI2a: target SELECTED: libkrb5 1.21.3-alt2:sisyphus+351857.100.1.1 at 1719735219
[i586] MI2a: requesting to install libkrb5 (unspec'd ver; inspect with Debug::pkgMark-shallow)
[i586] MI2a: marked for install (shallow): libkrb5
[i586] MI2a: satisfying Depends: libcom_err.so.2 >= set:ifPl8xIvqFmQe8JQo3
[i586] MI2a: maybe install (a providing target): libcom_err 1.47.1.0.10.ad56-alt2:sisyphus+363497.200.3.1 at 1732729916
[i586] MI2a: target SELECTED: libcom_err 1.47.1.0.10.ad56-alt2:sisyphus+363497.200.3.1 at 1732729916
[i586] MI2a: requesting to install libcom_err (unspec'd ver; inspect with Debug::pkgMark-shallow)
[i586] MI2a: marked for install (shallow): libcom_err
[i586] MI2a: satisfying Depends: libkeyutils.so.1 >= set:jfWn12U6KThBXgruPLZ68yYZt2
[i586] MI2a: maybe install (a providing target): libkeyutils 1.6.3-alt1:sisyphus+346336.200.2.2 at 1716472658
[i586] MI2a: target SELECTED: libkeyutils 1.6.3-alt1:sisyphus+346336.200.2.2 at 1716472658
[i586] MI2a: requesting to install libkeyutils (unspec'd ver; inspect with Debug::pkgMark-shallow)
[i586] MI2a: marked for install (shallow): libkeyutils
[i586] MI2a: satisfying Depends: liblmdb.so.0 >= set:kfalKd4xYAkaAG2MqeH0wB2F4kTaBEo1iv0KFpxVmqzFIV6HJ0
[i586] MI2a: maybe install (a providing target): liblmdb 0.9.33-alt1:sisyphus+360625.100.1.1 at 1729819639
[i586] MI2a: target SELECTED: liblmdb 0.9.33-alt1:sisyphus+360625.100.1.1 at 1729819639
[i586] MI2a: requesting to install liblmdb (unspec'd ver; inspect with Debug::pkgMark-shallow)
[i586] MI2a: marked for install (shallow): liblmdb
[i586] MI2a: satisfying Depends: libverto.so.1 >= set:jfI5MRvI6tmNn0zwQdb68Gk0
[i586] MI2a: maybe install (a providing target): libverto 0.3.2-alt1_1:sisyphus+321176.2200.10.2 at 1684806164
[i586] MI2a: target SELECTED: libverto 0.3.2-alt1_1:sisyphus+321176.2200.10.2 at 1684806164
[i586] MI2a: requesting to install libverto (unspec'd ver; inspect with Debug::pkgMark-shallow)
[i586] MI2a: marked for install (shallow): libverto
[i586] MI2a: satisfying Depends: libldap.so.2 >= set:njqWGgifGkup62BnqbMvIeUH81G53algzrHVZd
[i586] MI2a: maybe install (a providing target): libldap2 2.6.9-alt2:sisyphus+367501.300.4.1 at 1735841767
[i586] MI2a: target SELECTED: libldap2 2.6.9-alt2:sisyphus+367501.300.4.1 at 1735841767
[i586] MI2a: requesting to install libldap2 (unspec'd ver; inspect with Debug::pkgMark-shallow)
[i586] MI2a: marked for install (shallow): libldap2
[i586] MI2a: satisfying Depends: libsasl2.so.3 >= set:lhKAh7QjCM36Vnr6MdFxFf8LIcZsS1kl0wH7Iyp
[i586] MI2a: maybe install (a providing target): libsasl2-3 2.1.28-alt2.1:sisyphus+367419.100.1.1 at 1735482553
[i586] MI2a: target SELECTED: libsasl2-3 2.1.28-alt2.1:sisyphus+367419.100.1.1 at 1735482553
[i586] MI2a: requesting to install libsasl2-3 (unspec'd ver; inspect with Debug::pkgMark-shallow)
[i586] MI2a: marked for install (shallow): libsasl2-3
[i586] MI2a: satisfying Depends: openldap-common = 2.6.9-alt2:sisyphus+367501.300.4.1
[i586] MI2a: maybe install (a direct target): openldap-common 2.6.9-alt2:sisyphus+367501.300.4.1 at 1735841751
[i586] MI2a: target SELECTED: openldap-common 2.6.9-alt2:sisyphus+367501.300.4.1 at 1735841751
[i586] MI2a: requesting to install openldap-common (unspec'd ver; inspect with Debug::pkgMark-shallow)
[i586] MI2a: marked for install (shallow): openldap-common
[i586] MI2a: satisfying Depends: python3(gevent) < 0
[i586] MI2a: maybe install (a providing target): python3-module-gevent 24.11.1-alt1:sisyphus+378463.100.2.1 at 1742318310
[i586] MI2a: target SELECTED: python3-module-gevent 24.11.1-alt1:sisyphus+378463.100.2.1 at 1742318310
[i586] MI2a: requesting to install python3-module-gevent (unspec'd ver; inspect with Debug::pkgMark-shallow)
[i586] MI2a: marked for install (shallow): python3-module-gevent
[i586] MI2a: satisfying Depends: libcares.so.2 >= set:njZcqOo1pMV1HaF9aNphWwXAbWWHLWEuDVBCvmRA2
[i586] MI2a: maybe install (a providing target): libcares 1.34.4-alt1:sisyphus+366652.100.1.1 at 1735281169
[i586] MI2a: target SELECTED: libcares 1.34.4-alt1:sisyphus+366652.100.1.1 at 1735281169
[i586] MI2a: requesting to install libcares (unspec'd ver; inspect with Debug::pkgMark-shallow)
[i586] MI2a: marked for install (shallow): libcares
[i586] MI2a: satisfying Depends: libev.so.4 >= set:kePKyiZkErgk4oJyZD1pYiw8QUPkSlSo2oVWB4hEjYIlbFFasBbJvt9OeoFp4LMJ78Kc9UNyZkOb2wesW3ydCD7c9Y8WeSX5nuqixAjAvDr7Kfi0
[i586] MI2a: maybe install (a providing target): libev4 4.33-alt3:sisyphus+334335.340.4.1 at 1699912675
[i586] MI2a: target SELECTED: libev4 4.33-alt3:sisyphus+334335.340.4.1 at 1699912675
[i586] MI2a: requesting to install libev4 (unspec'd ver; inspect with Debug::pkgMark-shallow)
[i586] MI2a: marked for install (shallow): libev4
[i586] MI2a: satisfying Depends: libuv.so.1 >= set:mgRq8px87t4QhqZzhBUt9vZwZr1vmZnmzCV5IbCLaaZLWFkE9gdw6ZprPC1KJnsOvDMmsgo2Z9Ok94PMM6TDqSIad7nY65Cd1B98abNW7RWLiTl0xdTh57Mc6j9h1bEVXhWT93buejCqXts2
[i586] MI2a: maybe install (a providing target): libuv 1.50.0-alt1:sisyphus+377760.100.1.1 at 1741795923
[i586] MI2a: target SELECTED: libuv 1.50.0-alt1:sisyphus+377760.100.1.1 at 1741795923
[i586] MI2a: requesting to install libuv (unspec'd ver; inspect with Debug::pkgMark-shallow)
[i586] MI2a: marked for install (shallow): libuv
[i586] MI2a: satisfying Depends: python3(zope.event) < 0
[i586] MI2a: maybe install (a providing target): python3-module-zope.event 5.0-alt1.1:sisyphus+325755.140.2.1 at 1690991538
[i586] MI2a: target SELECTED: python3-module-zope.event 5.0-alt1.1:sisyphus+325755.140.2.1 at 1690991538
[i586] MI2a: requesting to install python3-module-zope.event (unspec'd ver; inspect with Debug::pkgMark-shallow)
[i586] MI2a: marked for install (shallow): python3-module-zope.event
[i586] MI2a: satisfying Depends: python3(zope) < 0
[i586] MI2a: maybe install (a providing target): python3-module-zope 3.3.0-alt9:sisyphus+281937.200.4.1 at 1628175910
[i586] MI2a: target SELECTED: python3-module-zope 3.3.0-alt9:sisyphus+281937.200.4.1 at 1628175910
[i586] MI2a: requesting to install python3-module-zope (unspec'd ver; inspect with Debug::pkgMark-shallow)
[i586] MI2a: marked for install (shallow): python3-module-zope
[i586] MI2a: satisfying Depends: python3-module-zope.interface (NULL)
[i586] MI2a: maybe install (a direct target): python3-module-zope.interface 7.2-alt1:sisyphus+363572.100.1.1 at 1732797442
[i586] MI2a: target SELECTED: python3-module-zope.interface 7.2-alt1:sisyphus+363572.100.1.1 at 1732797442
[i586] MI2a: requesting to install python3-module-zope.interface (unspec'd ver; inspect with Debug::pkgMark-shallow)
[i586] MI2a: marked for install (shallow): python3-module-zope.interface
[i586] MI2a: satisfying Depends: python3-module-zc (NULL)
[i586] MI2a: maybe install (a direct target): python3-module-zc 1.0.0-alt7:sisyphus+284857.100.1.1 at 1631109117
[i586] MI2a: target SELECTED: python3-module-zc 1.0.0-alt7:sisyphus+284857.100.1.1 at 1631109117
[i586] MI2a: requesting to install python3-module-zc (unspec'd ver; inspect with Debug::pkgMark-shallow)
[i586] MI2a: marked for install (shallow): python3-module-zc
[i586] MI2a: satisfying Depends: python3-module-z3c (NULL)
[i586] MI2a: maybe install (a direct target): python3-module-z3c 3.0.0-alt4:sisyphus+284857.200.1.1 at 1631109149
[i586] MI2a: target SELECTED: python3-module-z3c 3.0.0-alt4:sisyphus+284857.200.1.1 at 1631109149
[i586] MI2a: requesting to install python3-module-z3c (unspec'd ver; inspect with Debug::pkgMark-shallow)
[i586] MI2a: marked for install (shallow): python3-module-z3c
[i586] MI2a: satisfying Depends: python3(paste.deploy) < 0
[i586] MI2a: maybe install (a providing target): python3-module-PasteDeploy 1:3.1-alt1:sisyphus+343658.100.1.1 at 1711471990
[i586] MI2a: target SELECTED: python3-module-PasteDeploy 1:3.1-alt1:sisyphus+343658.100.1.1 at 1711471990
[i586] MI2a: requesting to install python3-module-PasteDeploy (unspec'd ver; inspect with Debug::pkgMark-shallow)
[i586] MI2a: marked for install (shallow): python3-module-PasteDeploy
[i586] MI2a: satisfying Depends: python3(Paste) < 0
[i586] MI2a: maybe install (a providing target): python3-module-paste 3.10.1-alt1:sisyphus+364772.70.5.1 at 1733996555
[i586] MI2a: target SELECTED: python3-module-paste 3.10.1-alt1:sisyphus+364772.70.5.1 at 1733996555
[i586] MI2a: requesting to install python3-module-paste (unspec'd ver; inspect with Debug::pkgMark-shallow)
[i586] MI2a: marked for install (shallow): python3-module-paste
[i586] MI2a: satisfying Depends: python3(openid.consumer) < 0
[i586] MI2a: maybe install (a providing target): python3-module-openid 3.2.0-alt1:sisyphus+278049.100.2.1 at 1625998936
[i586] MI2a: target SELECTED: python3-module-openid 3.2.0-alt1:sisyphus+278049.100.2.1 at 1625998936
[i586] MI2a: requesting to install python3-module-openid (unspec'd ver; inspect with Debug::pkgMark-shallow)
[i586] MI2a: marked for install (shallow): python3-module-openid
[i586] MI2a: satisfying Depends: python3(paste.script.templates) < 0
[i586] MI2a: maybe install (a providing target): python3-module-PasteScript 1:3.7.0-alt1:sisyphus+370910.100.1.1 at 1737573838
[i586] MI2a: target SELECTED: python3-module-PasteScript 1:3.7.0-alt1:sisyphus+370910.100.1.1 at 1737573838
[i586] MI2a: requesting to install python3-module-PasteScript (unspec'd ver; inspect with Debug::pkgMark-shallow)
[i586] MI2a: marked for install (shallow): python3-module-PasteScript
[i586] MI2a: satisfying Depends: python3(Cheetah) < 0
[i586] MI2a: maybe install (a providing target): python3-module-Cheetah 3.4.0-alt1.1:sisyphus+373381.100.1.1 at 1738840655
[i586] MI2a: target SELECTED: python3-module-Cheetah 3.4.0-alt1.1:sisyphus+373381.100.1.1 at 1738840655
[i586] MI2a: requesting to install python3-module-Cheetah (unspec'd ver; inspect with Debug::pkgMark-shallow)
[i586] MI2a: marked for install (shallow): python3-module-Cheetah
[i586] MI2a: satisfying Depends: python3(pkg_resources) < 0
[i586] MI2a: maybe install (a providing target): python3-module-pkg_resources 1:75.8.0-alt3:sisyphus+377826.100.1.1 at 1741863628
[i586] MI2a: target SELECTED: python3-module-pkg_resources 1:75.8.0-alt3:sisyphus+377826.100.1.1 at 1741863628
[i586] MI2a: requesting to install python3-module-pkg_resources (unspec'd ver; inspect with Debug::pkgMark-shallow)
[i586] MI2a: marked for install (shallow): python3-module-pkg_resources
[i586] MI2a: satisfying Depends: python3-module-jaraco-collections (NULL)
[i586] MI2a: maybe install (a providing target): python3-module-jaraco.collections 5.1.0-alt1:sisyphus+357809.200.1.1 at 1726769173
[i586] MI2a: target SELECTED: python3-module-jaraco.collections 5.1.0-alt1:sisyphus+357809.200.1.1 at 1726769173
[i586] MI2a: requesting to install python3-module-jaraco.collections (unspec'd ver; inspect with Debug::pkgMark-shallow)
[i586] MI2a: marked for install (shallow): python3-module-jaraco.collections
[i586] MI2a: satisfying Depends: python3-module-jaraco-text (NULL)
[i586] MI2a: maybe install (a providing target): python3-module-jaraco.text 4.0.0-alt1:sisyphus+353877.400.2.1 at 1722250727
[i586] MI2a: target SELECTED: python3-module-jaraco.text 4.0.0-alt1:sisyphus+353877.400.2.1 at 1722250727
[i586] MI2a: requesting to install python3-module-jaraco.text (unspec'd ver; inspect with Debug::pkgMark-shallow)
[i586] MI2a: marked for install (shallow): python3-module-jaraco.text
[i586] MI2a: satisfying Depends: python3-module-autocommand (NULL)
[i586] MI2a: maybe install (a direct target): python3-module-autocommand 2.2.2-alt1.1:sisyphus+339714.100.1.1 at 1706968174
[i586] MI2a: target SELECTED: python3-module-autocommand 2.2.2-alt1.1:sisyphus+339714.100.1.1 at 1706968174
[i586] MI2a: requesting to install python3-module-autocommand (unspec'd ver; inspect with Debug::pkgMark-shallow)
[i586] MI2a: marked for install (shallow): python3-module-autocommand
[i586] MI2a: satisfying Depends: python3-module-jaraco-context (NULL)
[i586] MI2a: maybe install (a providing target): python3-module-jaraco.context 6.0.1-alt1:sisyphus+357809.300.1.1 at 1726769204
[i586] MI2a: target SELECTED: python3-module-jaraco.context 6.0.1-alt1:sisyphus+357809.300.1.1 at 1726769204
[i586] MI2a: requesting to install python3-module-jaraco.context (unspec'd ver; inspect with Debug::pkgMark-shallow)
[i586] MI2a: marked for install (shallow): python3-module-jaraco.context
[i586] MI2a: satisfying Depends: python3-module-jaraco-functools (NULL)
[i586] MI2a: maybe install (a providing target): python3-module-jaraco.functools 4.1.0-alt1:sisyphus+358564.100.1.1 at 1727528718
[i586] MI2a: target SELECTED: python3-module-jaraco.functools 4.1.0-alt1:sisyphus+358564.100.1.1 at 1727528718
[i586] MI2a: requesting to install python3-module-jaraco.functools (unspec'd ver; inspect with Debug::pkgMark-shallow)
[i586] MI2a: marked for install (shallow): python3-module-jaraco.functools
[i586] MI2a: satisfying Depends: python3(more_itertools) < 0
[i586] MI2a: maybe install (a providing target): python3-module-more-itertools 10.6.0-alt1:sisyphus+369595.100.2.1 at 1737017267
[i586] MI2a: target SELECTED: python3-module-more-itertools 10.6.0-alt1:sisyphus+369595.100.2.1 at 1737017267
[i586] MI2a: requesting to install python3-module-more-itertools (unspec'd ver; inspect with Debug::pkgMark-shallow)
[i586] MI2a: marked for install (shallow): python3-module-more-itertools
[i586] MI2a: satisfying Depends: python3-module-platformdirs (NULL)
[i586] MI2a: maybe install (a direct target): python3-module-platformdirs 4.3.7-alt1:sisyphus+378659.100.2.1 at 1742562597
[i586] MI2a: target SELECTED: python3-module-platformdirs 4.3.7-alt1:sisyphus+378659.100.2.1 at 1742562597
[i586] MI2a: requesting to install python3-module-platformdirs (unspec'd ver; inspect with Debug::pkgMark-shallow)
[i586] MI2a: marked for install (shallow): python3-module-platformdirs
[i586] MI2a: satisfying Depends: python3-module-wheel (NULL)
[i586] MI2a: maybe install (a direct target): python3-module-wheel 0.45.1-alt1:sisyphus+363326.100.2.1 at 1732609969
[i586] MI2a: target SELECTED: python3-module-wheel 0.45.1-alt1:sisyphus+363326.100.2.1 at 1732609969
[i586] MI2a: requesting to install python3-module-wheel (unspec'd ver; inspect with Debug::pkgMark-shallow)
[i586] MI2a: marked for install (shallow): python3-module-wheel
[i586] MI2a: satisfying Depends: python3(tornado.httpserver) < 0
[i586] MI2a: maybe install (a providing target): python3-module-tornado 6.4.2-alt1:sisyphus+363445.100.1.1 at 1732635493
[i586] MI2a: target SELECTED: python3-module-tornado 6.4.2-alt1:sisyphus+363445.100.1.1 at 1732635493
[i586] MI2a: requesting to install python3-module-tornado (unspec'd ver; inspect with Debug::pkgMark-shallow)
[i586] MI2a: marked for install (shallow): python3-module-tornado
[i586] MI2a: satisfying Depends: python3-module-certifi (NULL)
[i586] MI2a: maybe install (a direct target): python3-module-certifi 2024.12.14-alt1:sisyphus+369729.200.2.2 at 1737050219
[i586] MI2a: target SELECTED: python3-module-certifi 2024.12.14-alt1:sisyphus+369729.200.2.2 at 1737050219
[i586] MI2a: requesting to install python3-module-certifi (unspec'd ver; inspect with Debug::pkgMark-shallow)
[i586] MI2a: marked for install (shallow): python3-module-certifi
[i586] MI2a: satisfying Depends: python3(pycares) < 0
[i586] MI2a: maybe install (a providing target): python3-module-pycares 4.5.0-alt1:sisyphus+372989.100.1.1 at 1738501858
[i586] MI2a: target SELECTED: python3-module-pycares 4.5.0-alt1:sisyphus+372989.100.1.1 at 1738501858
[i586] MI2a: requesting to install python3-module-pycares (unspec'd ver; inspect with Debug::pkgMark-shallow)
[i586] MI2a: marked for install (shallow): python3-module-pycares
[i586] MI2a: satisfying Depends: python3(twisted.internet.abstract) < 0
[i586] MI2a: maybe install (a providing target): python3-module-twisted-core 24.11.0-alt2:sisyphus+376609.40.2.1 at 1740866761
[i586] MI2a: target SELECTED: python3-module-twisted-core 24.11.0-alt2:sisyphus+376609.40.2.1 at 1740866761
[i586] MI2a: requesting to install python3-module-twisted-core (unspec'd ver; inspect with Debug::pkgMark-shallow)
[i586] MI2a: marked for install (shallow): python3-module-twisted-core
[i586] MI2a: satisfying Depends: python3(appdirs) < 0
[i586] MI2a: maybe install (a providing target): python3-module-appdirs 1.4.4-alt2:sisyphus+359005.100.1.1 at 1728036426
[i586] MI2a: target SELECTED: python3-module-appdirs 1.4.4-alt2:sisyphus+359005.100.1.1 at 1728036426
[i586] MI2a: requesting to install python3-module-appdirs (unspec'd ver; inspect with Debug::pkgMark-shallow)
[i586] MI2a: marked for install (shallow): python3-module-appdirs
[i586] MI2a: satisfying Depends: python3(automat) < 0
[i586] MI2a: maybe install (a providing target): python3-module-automat 24.8.1-alt1:sisyphus+355768.100.2.1 at 1724411664
[i586] MI2a: target SELECTED: python3-module-automat 24.8.1-alt1:sisyphus+355768.100.2.1 at 1724411664
[i586] MI2a: requesting to install python3-module-automat (unspec'd ver; inspect with Debug::pkgMark-shallow)
[i586] MI2a: marked for install (shallow): python3-module-automat
[i586] MI2a: satisfying Depends: python3(hyperlink) < 0
[i586] MI2a: maybe install (a providing target): python3-module-hyperlink 21.0.0-alt1.1:sisyphus+304836.100.1.1 at 1659710964
[i586] MI2a: target SELECTED: python3-module-hyperlink 21.0.0-alt1.1:sisyphus+304836.100.1.1 at 1659710964
[i586] MI2a: requesting to install python3-module-hyperlink (unspec'd ver; inspect with Debug::pkgMark-shallow)
[i586] MI2a: marked for install (shallow): python3-module-hyperlink
[i586] MI2a: satisfying Depends: python3(serial) < 0
[i586] MI2a: maybe install (a providing target): python3-module-serial 3.5-alt3:sisyphus+360600.100.2.1 at 1729786231
[i586] MI2a: target SELECTED: python3-module-serial 3.5-alt3:sisyphus+360600.100.2.1 at 1729786231
[i586] MI2a: requesting to install python3-module-serial (unspec'd ver; inspect with Debug::pkgMark-shallow)
[i586] MI2a: marked for install (shallow): python3-module-serial
[i586] MI2a: satisfying Depends: python3(hid) < 0
[i586] MI2a: maybe install (a providing target): python3-module-cython-hidapi 0.14.0-alt1.1:sisyphus+333513.54340.73.1 at 1704649757
[i586] MI2a: target SELECTED: python3-module-cython-hidapi 0.14.0-alt1.1:sisyphus+333513.54340.73.1 at 1704649757
[i586] MI2a: requesting to install python3-module-cython-hidapi (unspec'd ver; inspect with Debug::pkgMark-shallow)
[i586] MI2a: marked for install (shallow): python3-module-cython-hidapi
[i586] MI2a: satisfying Depends: libhidapi-hidraw.so.0 >= set:idVzQSm8qwHaDxTkTjc0uUa9b4LCTWaiqTzomaKPl5
[i586] MI2a: maybe install (a providing target): libhidapi 0.14.0-alt1:sisyphus+378183.100.1.1 at 1742067547
[i586] MI2a: target SELECTED: libhidapi 0.14.0-alt1:sisyphus+378183.100.1.1 at 1742067547
[i586] MI2a: requesting to install libhidapi (unspec'd ver; inspect with Debug::pkgMark-shallow)
[i586] MI2a: marked for install (shallow): libhidapi
[i586] MI2a: satisfying Depends: libusb-1.0.so.0 >= set:kfVTRgUEIUmjFX2IAipIvyS7RTRZqexJaD3JlmiYanqVHFDk94KrEEGfYdbQ1ana
[i586] MI2a: maybe install (a providing target): libusb 1.0.27-alt1:sisyphus+347412.100.1.1 at 1714739652
[i586] MI2a: target SELECTED: libusb 1.0.27-alt1:sisyphus+347412.100.1.1 at 1714739652
[i586] MI2a: requesting to install libusb (unspec'd ver; inspect with Debug::pkgMark-shallow)
[i586] MI2a: marked for install (shallow): libusb
[i586] MI2a: satisfying Depends: python3-module-twisted-logger = 24.11.0-alt2:sisyphus+376609.40.2.1
[i586] MI2a: maybe install (a direct target): python3-module-twisted-logger 24.11.0-alt2:sisyphus+376609.40.2.1 at 1740866761
[i586] MI2a: target SELECTED: python3-module-twisted-logger 24.11.0-alt2:sisyphus+376609.40.2.1 at 1740866761
[i586] MI2a: requesting to install python3-module-twisted-logger (unspec'd ver; inspect with Debug::pkgMark-shallow)
[i586] MI2a: marked for install (shallow): python3-module-twisted-logger
[i586] MI2a: satisfying Depends: python3(constantly) < 0
[i586] MI2a: maybe install (a providing target): python3-module-constantly 15.1.0-alt7:sisyphus+338906.100.1.1 at 1706107088
[i586] MI2a: target SELECTED: python3-module-constantly 15.1.0-alt7:sisyphus+338906.100.1.1 at 1706107088
[i586] MI2a: requesting to install python3-module-constantly (unspec'd ver; inspect with Debug::pkgMark-shallow)
[i586] MI2a: marked for install (shallow): python3-module-constantly
[i586] MI2a: satisfying Depends: python3(incremental) < 0
[i586] MI2a: maybe install (a providing target): python3-module-incremental 22.10.0-alt1:sisyphus+312706.100.1.1 at 1672404273
[i586] MI2a: target SELECTED: python3-module-incremental 22.10.0-alt1:sisyphus+312706.100.1.1 at 1672404273
[i586] MI2a: requesting to install python3-module-incremental (unspec'd ver; inspect with Debug::pkgMark-shallow)
[i586] MI2a: marked for install (shallow): python3-module-incremental
[i586] MI2a: satisfying Depends: python3(click) < 0
[i586] MI2a: maybe install (a providing target): python3-module-click 8.1.8-alt1:sisyphus+366297.100.1.1 at 1734946237
[i586] MI2a: target SELECTED: python3-module-click 8.1.8-alt1:sisyphus+366297.100.1.1 at 1734946237
[i586] MI2a: requesting to install python3-module-click (unspec'd ver; inspect with Debug::pkgMark-shallow)
[i586] MI2a: marked for install (shallow): python3-module-click
[i586] MI2a: satisfying Depends: python3-module-twisted-web = 24.11.0-alt2:sisyphus+376609.40.2.1
[i586] MI2a: maybe install (a direct target): python3-module-twisted-web 24.11.0-alt2:sisyphus+376609.40.2.1 at 1740866761
[i586] MI2a: target SELECTED: python3-module-twisted-web 24.11.0-alt2:sisyphus+376609.40.2.1 at 1740866761
[i586] MI2a: requesting to install python3-module-twisted-web (unspec'd ver; inspect with Debug::pkgMark-shallow)
[i586] MI2a: marked for install (shallow): python3-module-twisted-web
[i586] MI2a: satisfying Depends: python3(h2.config) < 0
[i586] MI2a: maybe install (a providing target): python3-module-h2 4.1.0-alt1:sisyphus+325714.100.2.2 at 1690478873
[i586] MI2a: target SELECTED: python3-module-h2 4.1.0-alt1:sisyphus+325714.100.2.2 at 1690478873
[i586] MI2a: requesting to install python3-module-h2 (unspec'd ver; inspect with Debug::pkgMark-shallow)
[i586] MI2a: marked for install (shallow): python3-module-h2
[i586] MI2a: satisfying Depends: python3-module-hyperframe < 7
[i586] MI2a: maybe install (a direct target): python3-module-hyperframe 6.0.1-alt1:sisyphus+270376.300.2.1 at 1618957001
[i586] MI2a: target SELECTED: python3-module-hyperframe 6.0.1-alt1:sisyphus+270376.300.2.1 at 1618957001
[i586] MI2a: requesting to install python3-module-hyperframe (unspec'd ver; inspect with Debug::pkgMark-shallow)
[i586] MI2a: marked for install (shallow): python3-module-hyperframe
[i586] MI2a: satisfying Depends: python3-module-hpack < 5
[i586] MI2a: maybe install (a direct target): python3-module-hpack 4.0.0-alt1:sisyphus+270376.200.1.1 at 1618956626
[i586] MI2a: target SELECTED: python3-module-hpack 4.0.0-alt1:sisyphus+270376.200.1.1 at 1618956626
[i586] MI2a: requesting to install python3-module-hpack (unspec'd ver; inspect with Debug::pkgMark-shallow)
[i586] MI2a: marked for install (shallow): python3-module-hpack
[i586] MI2a: satisfying Depends: python3(priority) < 0
[i586] MI2a: maybe install (a providing target): python3-module-priority 2.0.0-alt3:sisyphus+338701.100.1.2 at 1705988383
[i586] MI2a: target SELECTED: python3-module-priority 2.0.0-alt3:sisyphus+338701.100.1.2 at 1705988383
[i586] MI2a: requesting to install python3-module-priority (unspec'd ver; inspect with Debug::pkgMark-shallow)
[i586] MI2a: marked for install (shallow): python3-module-priority
[i586] MI2a: satisfying Depends: python3(typing_extensions) < 0
[i586] MI2a: maybe install (a providing target): python3-module-typing_extensions 4.13.0-alt1:sisyphus+379896.100.1.1 at 1743509204
[i586] MI2a: target SELECTED: python3-module-typing_extensions 4.13.0-alt1:sisyphus+379896.100.1.1 at 1743509204
[i586] MI2a: requesting to install python3-module-typing_extensions (unspec'd ver; inspect with Debug::pkgMark-shallow)
[i586] MI2a: marked for install (shallow): python3-module-typing_extensions
[i586] MI2a: satisfying Depends: python3-module-twisted-words = 24.11.0-alt2:sisyphus+376609.40.2.1
[i586] MI2a: maybe install (a direct target): python3-module-twisted-words 24.11.0-alt2:sisyphus+376609.40.2.1 at 1740866761
[i586] MI2a: target SELECTED: python3-module-twisted-words 24.11.0-alt2:sisyphus+376609.40.2.1 at 1740866761
[i586] MI2a: requesting to install python3-module-twisted-words (unspec'd ver; inspect with Debug::pkgMark-shallow)
[i586] MI2a: marked for install (shallow): python3-module-twisted-words
[i586] MI2a: satisfying Depends: python3(twisted.names.cache) < 0
[i586] MI2a: maybe install (a providing target): python3-module-twisted-names 24.11.0-alt2:sisyphus+376609.40.2.1 at 1740866761
[i586] MI2a: target SELECTED: python3-module-twisted-names 24.11.0-alt2:sisyphus+376609.40.2.1 at 1740866761
[i586] MI2a: requesting to install python3-module-twisted-names (unspec'd ver; inspect with Debug::pkgMark-shallow)
[i586] MI2a: marked for install (shallow): python3-module-twisted-names
[i586] MI2a: satisfying Depends: python3(multidict) < 0
[i586] MI2a: maybe install (a providing target): python3-module-multidict 6.3.0-alt1:sisyphus+379928.100.1.1 at 1743519215
[i586] MI2a: target SELECTED: python3-module-multidict 6.3.0-alt1:sisyphus+379928.100.1.1 at 1743519215
[i586] MI2a: requesting to install python3-module-multidict (unspec'd ver; inspect with Debug::pkgMark-shallow)
[i586] MI2a: marked for install (shallow): python3-module-multidict
[i586] MI2a: satisfying Depends: python3(propcache.api) < 0
[i586] MI2a: maybe install (a providing target): python3-module-propcache 0.2.1-alt1:sisyphus+369528.100.1.1 at 1736868993
[i586] MI2a: target SELECTED: python3-module-propcache 0.2.1-alt1:sisyphus+369528.100.1.1 at 1736868993
[i586] MI2a: requesting to install python3-module-propcache (unspec'd ver; inspect with Debug::pkgMark-shallow)
[i586] MI2a: marked for install (shallow): python3-module-propcache
[i586] MI2a: satisfying Depends: python3(yarl) < 0
[i586] MI2a: maybe install (a providing target): python3-module-yarl 1.18.3-alt1:sisyphus+369529.100.2.1 at 1736876452
[i586] MI2a: target SELECTED: python3-module-yarl 1.18.3-alt1:sisyphus+369529.100.2.1 at 1736876452
[i586] MI2a: requesting to install python3-module-yarl (unspec'd ver; inspect with Debug::pkgMark-shallow)
[i586] MI2a: marked for install (shallow): python3-module-yarl
[i586] MI2a: satisfying Depends: python3(aiohttp_asgi) < 0
[i586] MI2a: maybe install (a providing target): python3-module-aiohttp-asgi 0.5.2-alt2:sisyphus+380033.100.1.1 at 1743605945
[i586] MI2a: target SELECTED: python3-module-aiohttp-asgi 0.5.2-alt2:sisyphus+380033.100.1.1 at 1743605945
[i586] MI2a: requesting to install python3-module-aiohttp-asgi (unspec'd ver; inspect with Debug::pkgMark-shallow)
[i586] MI2a: marked for install (shallow): python3-module-aiohttp-asgi
[i586] MI2a: satisfying Depends: python3(asgiref.typing) < 0
[i586] MI2a: maybe install (a providing target): python3-module-asgiref 3.8.1-alt1:sisyphus+372174.1500.2.1 at 1738333633
[i586] MI2a: target SELECTED: python3-module-asgiref 3.8.1-alt1:sisyphus+372174.1500.2.1 at 1738333633
[i586] MI2a: requesting to install python3-module-asgiref (unspec'd ver; inspect with Debug::pkgMark-shallow)
[i586] MI2a: marked for install (shallow): python3-module-asgiref
[i586] MI2a: satisfying Depends: python3(croniter) < 0
[i586] MI2a: maybe install (a providing target): python3-module-croniter 6.0.0-alt1:sisyphus+365336.100.1.1 at 1734511703
[i586] MI2a: target SELECTED: python3-module-croniter 6.0.0-alt1:sisyphus+365336.100.1.1 at 1734511703
[i586] MI2a: requesting to install python3-module-croniter (unspec'd ver; inspect with Debug::pkgMark-shallow)
[i586] MI2a: marked for install (shallow): python3-module-croniter
[i586] MI2a: satisfying Depends: python3-module-python-dateutil (NULL)
[i586] MI2a: maybe install (a providing target): python3-module-dateutil 2.9.0.post0-alt1:sisyphus+378451.100.1.1 at 1742313746
[i586] MI2a: target SELECTED: python3-module-dateutil 2.9.0.post0-alt1:sisyphus+378451.100.1.1 at 1742313746
[i586] MI2a: requesting to install python3-module-dateutil (unspec'd ver; inspect with Debug::pkgMark-shallow)
[i586] MI2a: marked for install (shallow): python3-module-dateutil
[i586] MI2a: satisfying Depends: python3(six) < 0
[i586] MI2a: maybe install (a providing target): python3-module-six 1.17.0-alt1.1:sisyphus+373470.100.1.1 at 1738920023
[i586] MI2a: target SELECTED: python3-module-six 1.17.0-alt1.1:sisyphus+373470.100.1.1 at 1738920023
[i586] MI2a: requesting to install python3-module-six (unspec'd ver; inspect with Debug::pkgMark-shallow)
[i586] MI2a: marked for install (shallow): python3-module-six
[i586] MI2a: satisfying Depends: python3-module-pytz (NULL)
[i586] MI2a: maybe install (a direct target): python3-module-pytz 1:2025.2-alt1:sisyphus+379213.100.2.1 at 1742985453
[i586] MI2a: target SELECTED: python3-module-pytz 1:2025.2-alt1:sisyphus+379213.100.2.1 at 1742985453
[i586] MI2a: requesting to install python3-module-pytz (unspec'd ver; inspect with Debug::pkgMark-shallow)
[i586] MI2a: marked for install (shallow): python3-module-pytz
[i586] MI2a: satisfying Depends: python3(dnslib) < 0
[i586] MI2a: maybe install (a providing target): python3-module-dnslib 0.9.7-alt3:sisyphus+241021.100.1.1 at 1574174669
[i586] MI2a: target SELECTED: python3-module-dnslib 0.9.7-alt3:sisyphus+241021.100.1.1 at 1574174669
[i586] MI2a: requesting to install python3-module-dnslib (unspec'd ver; inspect with Debug::pkgMark-shallow)
[i586] MI2a: marked for install (shallow): python3-module-dnslib
[i586] MI2a: satisfying Depends: python3(raven) < 0
[i586] MI2a: maybe install (a providing target): python3-module-raven 6.10.0-alt2:sisyphus+280727.100.1.1 at 1627279692
[i586] MI2a: target SELECTED: python3-module-raven 6.10.0-alt2:sisyphus+280727.100.1.1 at 1627279692
[i586] MI2a: requesting to install python3-module-raven (unspec'd ver; inspect with Debug::pkgMark-shallow)
[i586] MI2a: marked for install (shallow): python3-module-raven
[i586] MI2a: satisfying Depends: python3(ZConfig.components.logger.factory) < 0
[i586] MI2a: maybe install (a providing target): python3-module-zconfig 4.2-alt1:sisyphus+369722.100.1.2 at 1737043907
[i586] MI2a: target SELECTED: python3-module-zconfig 4.2-alt1:sisyphus+369722.100.1.2 at 1737043907
[i586] MI2a: requesting to install python3-module-zconfig (unspec'd ver; inspect with Debug::pkgMark-shallow)
[i586] MI2a: marked for install (shallow): python3-module-zconfig
[i586] MI2a: satisfying Depends: python3(pygments.lexer) < 0
[i586] MI2a: maybe install (a providing target): python3-module-Pygments 2.19.1-alt1:sisyphus+368586.100.2.1 at 1737039695
[i586] MI2a: target SELECTED: python3-module-Pygments 2.19.1-alt1:sisyphus+368586.100.2.1 at 1737039695
[i586] MI2a: requesting to install python3-module-Pygments (unspec'd ver; inspect with Debug::pkgMark-shallow)
[i586] MI2a: marked for install (shallow): python3-module-Pygments
[i586] MI2a: satisfying Depends: python3(blinker) < 0
[i586] MI2a: maybe install (a providing target): python3-module-blinker 1.9.0-alt1:sisyphus+362571.300.7.1 at 1734000808
[i586] MI2a: target SELECTED: python3-module-blinker 1.9.0-alt1:sisyphus+362571.300.7.1 at 1734000808
[i586] MI2a: requesting to install python3-module-blinker (unspec'd ver; inspect with Debug::pkgMark-shallow)
[i586] MI2a: marked for install (shallow): python3-module-blinker
[i586] MI2a: satisfying Depends: python3(celery.exceptions) < 0
[i586] MI2a: maybe install (a providing target): python3-module-celery 5.3.6-alt2:sisyphus+365444.100.1.1 at 1734621422
[i586] MI2a: target SELECTED: python3-module-celery 5.3.6-alt2:sisyphus+365444.100.1.1 at 1734621422
[i586] MI2a: requesting to install python3-module-celery (unspec'd ver; inspect with Debug::pkgMark-shallow)
[i586] MI2a: marked for install (shallow): python3-module-celery
[i586] MI2a: satisfying Depends: python3-module-kombu >= 4.6.10
[i586] MI2a: maybe install (a direct target): python3-module-kombu 1:5.3.5-alt2:sisyphus+340948.100.1.1 at 1708266319
[i586] MI2a: target SELECTED: python3-module-kombu 1:5.3.5-alt2:sisyphus+340948.100.1.1 at 1708266319
[i586] MI2a: requesting to install python3-module-kombu (unspec'd ver; inspect with Debug::pkgMark-shallow)
[i586] MI2a: marked for install (shallow): python3-module-kombu
[i586] MI2a: satisfying Depends: python3(amqp) < 0
[i586] MI2a: maybe install (a providing target): python3-module-amqp 1:5.3.1-alt1:sisyphus+362428.100.1.1 at 1731490592
[i586] MI2a: target SELECTED: python3-module-amqp 1:5.3.1-alt1:sisyphus+362428.100.1.1 at 1731490592
[i586] MI2a: requesting to install python3-module-amqp (unspec'd ver; inspect with Debug::pkgMark-shallow)
[i586] MI2a: marked for install (shallow): python3-module-amqp
[i586] MI2a: satisfying Depends: python3-module-vine (NULL)
[i586] MI2a: maybe install (a direct target): python3-module-vine 5.1.0-alt1:sisyphus+341591.100.2.2 at 1709198592
[i586] MI2a: target SELECTED: python3-module-vine 5.1.0-alt1:sisyphus+341591.100.2.2 at 1709198592
[i586] MI2a: requesting to install python3-module-vine (unspec'd ver; inspect with Debug::pkgMark-shallow)
[i586] MI2a: marked for install (shallow): python3-module-vine
[i586] MI2a: satisfying Depends: python3(botocore.client) < 0
[i586] MI2a: maybe install (a providing target): python3-module-botocore 1.37.13-alt1:sisyphus+378421.100.2.1 at 1742313489
[i586] MI2a: target SELECTED: python3-module-botocore 1.37.13-alt1:sisyphus+378421.100.2.1 at 1742313489
[i586] MI2a: requesting to install python3-module-botocore (unspec'd ver; inspect with Debug::pkgMark-shallow)
[i586] MI2a: marked for install (shallow): python3-module-botocore
[i586] MI2a: satisfying Depends: python3-module-jmespath (NULL)
[i586] MI2a: maybe install (a direct target): python3-module-jmespath 1.0.1-alt1:sisyphus+317988.100.2.1 at 1680612150
[i586] MI2a: target SELECTED: python3-module-jmespath 1.0.1-alt1:sisyphus+317988.100.2.1 at 1680612150
[i586] MI2a: requesting to install python3-module-jmespath (unspec'd ver; inspect with Debug::pkgMark-shallow)
[i586] MI2a: marked for install (shallow): python3-module-jmespath
[i586] MI2a: satisfying Depends: python3-module-urllib3 (NULL)
[i586] MI2a: maybe install (a direct target): python3-module-urllib3 2:2.3.0-alt1:sisyphus+366320.100.2.1 at 1735116352
[i586] MI2a: target SELECTED: python3-module-urllib3 2:2.3.0-alt1:sisyphus+366320.100.2.1 at 1735116352
[i586] MI2a: requesting to install python3-module-urllib3 (unspec'd ver; inspect with Debug::pkgMark-shallow)
[i586] MI2a: marked for install (shallow): python3-module-urllib3
[i586] MI2a: satisfying Depends: python3-module-requests (NULL)
[i586] MI2a: maybe install (a direct target): python3-module-requests 2.32.3-alt1:sisyphus+349946.100.1.1 at 1717059877
[i586] MI2a: target SELECTED: python3-module-requests 2.32.3-alt1:sisyphus+349946.100.1.1 at 1717059877
[i586] MI2a: requesting to install python3-module-requests (unspec'd ver; inspect with Debug::pkgMark-shallow)
[i586] MI2a: marked for install (shallow): python3-module-requests
[i586] MI2a: satisfying Depends: python3-module-charset-normalizer (NULL)
[i586] MI2a: maybe install (a direct target): python3-module-charset-normalizer 3.2.0-alt1:sisyphus+347396.200.2.1 at 1714733144
[i586] MI2a: target SELECTED: python3-module-charset-normalizer 3.2.0-alt1:sisyphus+347396.200.2.1 at 1714733144
[i586] MI2a: requesting to install python3-module-charset-normalizer (unspec'd ver; inspect with Debug::pkgMark-shallow)
[i586] MI2a: marked for install (shallow): python3-module-charset-normalizer
[i586] MI2a: satisfying Depends: python3(docutils) < 0
[i586] MI2a: maybe install (a providing target): python3-module-docutils 0.20.1-alt1:sisyphus+323438.100.1.1 at 1687370718
[i586] MI2a: target SELECTED: python3-module-docutils 0.20.1-alt1:sisyphus+323438.100.1.1 at 1687370718
[i586] MI2a: requesting to install python3-module-docutils (unspec'd ver; inspect with Debug::pkgMark-shallow)
[i586] MI2a: marked for install (shallow): python3-module-docutils
[i586] MI2a: satisfying Depends: python3(sphinx.locale) < 0
[i586] MI2a: maybe install (a providing target): python3-module-sphinx 1:8.2.1-alt1:sisyphus+376300.100.1.1 at 1740663832
[i586] MI2a: target SELECTED: python3-module-sphinx 1:8.2.1-alt1:sisyphus+376300.100.1.1 at 1740663832
[i586] MI2a: requesting to install python3-module-sphinx (unspec'd ver; inspect with Debug::pkgMark-shallow)
[i586] MI2a: marked for install (shallow): python3-module-sphinx
[i586] MI2a: satisfying Depends: python3(sphinxcontrib.applehelp) (NULL)
[i586] MI2a: maybe install (a providing target): python3-module-sphinxcontrib-applehelp 2.0.0-alt1:sisyphus+353872.100.1.1 at 1722243556
[i586] MI2a: target SELECTED: python3-module-sphinxcontrib-applehelp 2.0.0-alt1:sisyphus+353872.100.1.1 at 1722243556
[i586] MI2a: requesting to install python3-module-sphinxcontrib-applehelp (unspec'd ver; inspect with Debug::pkgMark-shallow)
[i586] MI2a: marked for install (shallow): python3-module-sphinxcontrib-applehelp
[i586] MI2a: satisfying Depends: python3(sphinxcontrib.devhelp) (NULL)
[i586] MI2a: maybe install (a providing target): python3-module-sphinxcontrib-devhelp 2.0.0-alt1:sisyphus+353872.200.1.1 at 1722243589
[i586] MI2a: target SELECTED: python3-module-sphinxcontrib-devhelp 2.0.0-alt1:sisyphus+353872.200.1.1 at 1722243589
[i586] MI2a: requesting to install python3-module-sphinxcontrib-devhelp (unspec'd ver; inspect with Debug::pkgMark-shallow)
[i586] MI2a: marked for install (shallow): python3-module-sphinxcontrib-devhelp
[i586] MI2a: satisfying Depends: python3(sphinxcontrib.jquery) (NULL)
[i586] MI2a: maybe install (a providing target): python3-module-sphinxcontrib-jquery 4.1-alt3:sisyphus+339023.100.1.1 at 1706234262
[i586] MI2a: target SELECTED: python3-module-sphinxcontrib-jquery 4.1-alt3:sisyphus+339023.100.1.1 at 1706234262
[i586] MI2a: requesting to install python3-module-sphinxcontrib-jquery (unspec'd ver; inspect with Debug::pkgMark-shallow)
[i586] MI2a: marked for install (shallow): python3-module-sphinxcontrib-jquery
[i586] MI2a: satisfying Depends: python3(sphinxcontrib.jsmath) (NULL)
[i586] MI2a: maybe install (a providing target): python3-module-sphinxcontrib-jsmath 1.0.1-alt2:sisyphus+348403.100.1.1 at 1716017686
[i586] MI2a: target SELECTED: python3-module-sphinxcontrib-jsmath 1.0.1-alt2:sisyphus+348403.100.1.1 at 1716017686
[i586] MI2a: requesting to install python3-module-sphinxcontrib-jsmath (unspec'd ver; inspect with Debug::pkgMark-shallow)
[i586] MI2a: marked for install (shallow): python3-module-sphinxcontrib-jsmath
[i586] MI2a: satisfying Depends: python3(sphinxcontrib.htmlhelp) (NULL)
[i586] MI2a: maybe install (a providing target): python3-module-sphinxcontrib-htmlhelp 2.1.0-alt1:sisyphus+353893.100.2.1 at 1722416845
[i586] MI2a: target SELECTED: python3-module-sphinxcontrib-htmlhelp 2.1.0-alt1:sisyphus+353893.100.2.1 at 1722416845
[i586] MI2a: requesting to install python3-module-sphinxcontrib-htmlhelp (unspec'd ver; inspect with Debug::pkgMark-shallow)
[i586] MI2a: marked for install (shallow): python3-module-sphinxcontrib-htmlhelp
[i586] MI2a: satisfying Depends: python3(sphinxcontrib.serializinghtml) (NULL)
[i586] MI2a: maybe install (a providing target): python3-module-sphinxcontrib-serializinghtml 2.0.0-alt1:sisyphus+361088.100.1.1 at 1730215552
[i586] MI2a: target SELECTED: python3-module-sphinxcontrib-serializinghtml 2.0.0-alt1:sisyphus+361088.100.1.1 at 1730215552
[i586] MI2a: requesting to install python3-module-sphinxcontrib-serializinghtml (unspec'd ver; inspect with Debug::pkgMark-shallow)
[i586] MI2a: marked for install (shallow): python3-module-sphinxcontrib-serializinghtml
[i586] MI2a: satisfying Depends: python3(sphinxcontrib.qthelp) (NULL)
[i586] MI2a: maybe install (a providing target): python3-module-sphinxcontrib-qthelp 2.0.0-alt1:sisyphus+353872.300.1.1 at 1722243619
[i586] MI2a: target SELECTED: python3-module-sphinxcontrib-qthelp 2.0.0-alt1:sisyphus+353872.300.1.1 at 1722243619
[i586] MI2a: requesting to install python3-module-sphinxcontrib-qthelp (unspec'd ver; inspect with Debug::pkgMark-shallow)
[i586] MI2a: marked for install (shallow): python3-module-sphinxcontrib-qthelp
[i586] MI2a: satisfying Depends: python3(babel) (NULL)
[i586] MI2a: maybe install (a providing target): python3-module-babel 1:2.15.0-alt1:sisyphus+353791.100.1.1 at 1722073848
[i586] MI2a: target SELECTED: python3-module-babel 1:2.15.0-alt1:sisyphus+353791.100.1.1 at 1722073848
[i586] MI2a: requesting to install python3-module-babel (unspec'd ver; inspect with Debug::pkgMark-shallow)
[i586] MI2a: marked for install (shallow): python3-module-babel
[i586] MI2a: satisfying Depends: python3(alabaster) (NULL)
[i586] MI2a: maybe install (a providing target): python3-module-alabaster 0.7.16-alt1:sisyphus+349698.100.1.1 at 1716897815
[i586] MI2a: target SELECTED: python3-module-alabaster 0.7.16-alt1:sisyphus+349698.100.1.1 at 1716897815
[i586] MI2a: requesting to install python3-module-alabaster (unspec'd ver; inspect with Debug::pkgMark-shallow)
[i586] MI2a: marked for install (shallow): python3-module-alabaster
[i586] MI2a: satisfying Depends: python3(defusedxml) (NULL)
[i586] MI2a: maybe install (a providing target): python3-module-defusedxml 0.7.1-alt1:sisyphus+274841.2300.1.1 at 1624295691
[i586] MI2a: target SELECTED: python3-module-defusedxml 0.7.1-alt1:sisyphus+274841.2300.1.1 at 1624295691
[i586] MI2a: requesting to install python3-module-defusedxml (unspec'd ver; inspect with Debug::pkgMark-shallow)
[i586] MI2a: marked for install (shallow): python3-module-defusedxml
[i586] MI2a: satisfying Depends: /usr/share/python-sphinx/objects.inv (NULL)
[i586] MI2a: maybe install (a providing target): python-sphinx-objects.inv 1:2.3.14.20250314-alt1:sisyphus+377959.100.1.1 at 1741992107
[i586] MI2a: target SELECTED: python-sphinx-objects.inv 1:2.3.14.20250314-alt1:sisyphus+377959.100.1.1 at 1741992107
[i586] MI2a: requesting to install python-sphinx-objects.inv (unspec'd ver; inspect with Debug::pkgMark-shallow)
[i586] MI2a: marked for install (shallow): python-sphinx-objects.inv
[i586] MI2a: satisfying Depends: python3(imagesize) < 0
[i586] MI2a: maybe install (a providing target): python3-module-imagesize 1.4.1-alt1:sisyphus+318084.100.1.1 at 1680697673
[i586] MI2a: target SELECTED: python3-module-imagesize 1.4.1-alt1:sisyphus+318084.100.1.1 at 1680697673
[i586] MI2a: requesting to install python3-module-imagesize (unspec'd ver; inspect with Debug::pkgMark-shallow)
[i586] MI2a: marked for install (shallow): python3-module-imagesize
[i586] MI2a: satisfying Depends: python3(jinja2) < 0
[i586] MI2a: maybe install (a providing target): python3-module-jinja2 3.1.6-alt1:sisyphus+377889.1500.2.1 at 1742249941
[i586] MI2a: target SELECTED: python3-module-jinja2 3.1.6-alt1:sisyphus+377889.1500.2.1 at 1742249941
[i586] MI2a: requesting to install python3-module-jinja2 (unspec'd ver; inspect with Debug::pkgMark-shallow)
[i586] MI2a: marked for install (shallow): python3-module-jinja2
[i586] MI2a: satisfying Depends: python3(markupsafe) < 0
[i586] MI2a: maybe install (a providing target): python3-module-markupsafe 1:3.0.2-alt1:sisyphus+360209.100.1.1 at 1729323052
[i586] MI2a: target SELECTED: python3-module-markupsafe 1:3.0.2-alt1:sisyphus+360209.100.1.1 at 1729323052
[i586] MI2a: requesting to install python3-module-markupsafe (unspec'd ver; inspect with Debug::pkgMark-shallow)
[i586] MI2a: marked for install (shallow): python3-module-markupsafe
[i586] MI2a: satisfying Depends: python3(roman_numerals) < 0
[i586] MI2a: maybe install (a providing target): python3-module-roman_numerals 3.1.0-alt1:sisyphus+376287.100.1.1 at 1740659993
[i586] MI2a: target SELECTED: python3-module-roman_numerals 3.1.0-alt1:sisyphus+376287.100.1.1 at 1740659993
[i586] MI2a: requesting to install python3-module-roman_numerals (unspec'd ver; inspect with Debug::pkgMark-shallow)
[i586] MI2a: marked for install (shallow): python3-module-roman_numerals
[i586] MI2a: satisfying Depends: python3(snowballstemmer) < 0
[i586] MI2a: maybe install (a providing target): python3-module-snowballstemmer 2.2.0-alt1:sisyphus+319215.100.1.1 at 1682346633
[i586] MI2a: target SELECTED: python3-module-snowballstemmer 2.2.0-alt1:sisyphus+319215.100.1.1 at 1682346633
[i586] MI2a: requesting to install python3-module-snowballstemmer (unspec'd ver; inspect with Debug::pkgMark-shallow)
[i586] MI2a: marked for install (shallow): python3-module-snowballstemmer
[i586] MI2a: satisfying Depends: python3-module-sphinx-sphinx-build-symlink = 1:8.2.1-alt1:sisyphus+376300.100.1.1
[i586] MI2a: maybe install (a direct target): python3-module-sphinx-sphinx-build-symlink 1:8.2.1-alt1:sisyphus+376300.100.1.1 at 1740663832
[i586] MI2a: target SELECTED: python3-module-sphinx-sphinx-build-symlink 1:8.2.1-alt1:sisyphus+376300.100.1.1 at 1740663832
[i586] MI2a: requesting to install python3-module-sphinx-sphinx-build-symlink (unspec'd ver; inspect with Debug::pkgMark-shallow)
[i586] MI2a: marked for install (shallow): python3-module-sphinx-sphinx-build-symlink
[i586] MI2a: satisfying Depends: python3(isodate) < 0
[i586] MI2a: maybe install (a providing target): python3-module-isodate 0.7.2-alt1:sisyphus+360454.100.1.1 at 1729616035
[i586] MI2a: target SELECTED: python3-module-isodate 0.7.2-alt1:sisyphus+360454.100.1.1 at 1729616035
[i586] MI2a: requesting to install python3-module-isodate (unspec'd ver; inspect with Debug::pkgMark-shallow)
[i586] MI2a: marked for install (shallow): python3-module-isodate
[i586] MI2a: satisfying Depends: python3(pymongo) < 0
[i586] MI2a: maybe install (a providing target): python3-module-pymongo 4.11.3-alt1:sisyphus+378428.100.1.1 at 1742304872
[i586] MI2a: target SELECTED: python3-module-pymongo 4.11.3-alt1:sisyphus+378428.100.1.1 at 1742304872
[i586] MI2a: requesting to install python3-module-pymongo (unspec'd ver; inspect with Debug::pkgMark-shallow)
[i586] MI2a: marked for install (shallow): python3-module-pymongo
[i586] MI2a: satisfying Depends: python3(service_identity) < 0
[i586] MI2a: maybe install (a providing target): python3-module-service_identity 24.2.0-alt1:sisyphus+362235.100.1.1 at 1731336596
[i586] MI2a: target SELECTED: python3-module-service_identity 24.2.0-alt1:sisyphus+362235.100.1.1 at 1731336596
[i586] MI2a: requesting to install python3-module-service_identity (unspec'd ver; inspect with Debug::pkgMark-shallow)
[i586] MI2a: marked for install (shallow): python3-module-service_identity
[i586] MI2a: satisfying Depends: python3(pyasn1.codec.der.decoder) < 0
[i586] MI2a: maybe install (a providing target): python3-module-pyasn1 0.6.1-alt1:sisyphus+357301.100.1.1 at 1740397762
[i586] MI2a: target SELECTED: python3-module-pyasn1 0.6.1-alt1:sisyphus+357301.100.1.1 at 1740397762
[i586] MI2a: requesting to install python3-module-pyasn1 (unspec'd ver; inspect with Debug::pkgMark-shallow)
[i586] MI2a: marked for install (shallow): python3-module-pyasn1
[i586] MI2a: satisfying Depends: python3-module-bson = 4.11.3-alt1:sisyphus+378428.100.1.1
[i586] MI2a: maybe install (a direct target): python3-module-bson 4.11.3-alt1:sisyphus+378428.100.1.1 at 1742304872
[i586] MI2a: target SELECTED: python3-module-bson 4.11.3-alt1:sisyphus+378428.100.1.1 at 1742304872
[i586] MI2a: requesting to install python3-module-bson (unspec'd ver; inspect with Debug::pkgMark-shallow)
[i586] MI2a: marked for install (shallow): python3-module-bson
[i586] MI2a: satisfying Depends: python3(sqlalchemy) < 0
[i586] MI2a: maybe install (a providing target): python3-module-sqlalchemy 2.0.40-alt1:sisyphus+380006.100.1.1 at 1743586293
[i586] MI2a: target SELECTED: python3-module-sqlalchemy 2.0.40-alt1:sisyphus+380006.100.1.1 at 1743586293
[i586] MI2a: requesting to install python3-module-sqlalchemy (unspec'd ver; inspect with Debug::pkgMark-shallow)
[i586] MI2a: marked for install (shallow): python3-module-sqlalchemy
[i586] MI2a: satisfying Depends: python3-modules-sqlite3 (NULL)
[i586] MI2a: maybe install (a direct target): python3-modules-sqlite3 3.12.9-alt1:sisyphus+376344.100.1.1 at 1740742068
[i586] MI2a: target SELECTED: python3-modules-sqlite3 3.12.9-alt1:sisyphus+376344.100.1.1 at 1740742068
[i586] MI2a: requesting to install python3-modules-sqlite3 (unspec'd ver; inspect with Debug::pkgMark-shallow)
[i586] MI2a: marked for install (shallow): python3-modules-sqlite3
[i586] MI2a: satisfying Depends: libsqlite3.so.0 >= set:ohbW8uvwE0AySekmaizOFVAhtivtNj465Jaq19KSn7gWBWHMZzUdeZFRZIlLMCDNHGfq3JQppRdwivwATaeCInZrCLJFYi1I6TwFGaoDiUzRZ0ZczZkNfeIbzVVIZphh6C0GhVy6OfMlkGjrO2NIBIVlSm2JbsGPotQwdzp8sw1iII7dAdkHysDJnhx5O8xXqZHCZBGY9zibimpwaELD9YJYj7rszqZ0oIoGBPSqUxjm3pXb0
[i586] MI2a: maybe install (a providing target): libsqlite3 3.47.1-alt1:sisyphus+375553.2600.2.1 at 1740150182
[i586] MI2a: target SELECTED: libsqlite3 3.47.1-alt1:sisyphus+375553.2600.2.1 at 1740150182
[i586] MI2a: requesting to install libsqlite3 (unspec'd ver; inspect with Debug::pkgMark-shallow)
[i586] MI2a: marked for install (shallow): libsqlite3
[i586] MI2a: satisfying Depends: python3(mypy) < 0
[i586] MI2a: maybe install (a providing target): python3-module-mypy 1.15.0-alt1:sisyphus+374439.100.1.1 at 1739354481
[i586] MI2a: target SELECTED: python3-module-mypy 1.15.0-alt1:sisyphus+374439.100.1.1 at 1739354481
[i586] MI2a: requesting to install python3-module-mypy (unspec'd ver; inspect with Debug::pkgMark-shallow)
[i586] MI2a: marked for install (shallow): python3-module-mypy
[i586] MI2a: satisfying Depends: python3-module-mypy-extensions (NULL)
[i586] MI2a: maybe install (a providing target): python3-module-mypy_extensions 1.0.0-alt1:sisyphus+316350.100.2.1 at 1678357948
[i586] MI2a: target SELECTED: python3-module-mypy_extensions 1.0.0-alt1:sisyphus+316350.100.2.1 at 1678357948
[i586] MI2a: requesting to install python3-module-mypy_extensions (unspec'd ver; inspect with Debug::pkgMark-shallow)
[i586] MI2a: marked for install (shallow): python3-module-mypy_extensions
[i586] MI2a: satisfying Depends: python3-module-billiard >= 3.6.3
[i586] MI2a: maybe install (a direct target): python3-module-billiard 4.2.1-alt1:sisyphus+378410.100.1.1 at 1742300464
[i586] MI2a: target SELECTED: python3-module-billiard 4.2.1-alt1:sisyphus+378410.100.1.1 at 1742300464
[i586] MI2a: requesting to install python3-module-billiard (unspec'd ver; inspect with Debug::pkgMark-shallow)
[i586] MI2a: marked for install (shallow): python3-module-billiard
[i586] MI2a: satisfying Depends: python3(click_didyoumean) < 0
[i586] MI2a: maybe install (a providing target): python3-module-click-didyoumean 0.3.1-alt1:sisyphus+359293.100.1.1 at 1728402783
[i586] MI2a: target SELECTED: python3-module-click-didyoumean 0.3.1-alt1:sisyphus+359293.100.1.1 at 1728402783
[i586] MI2a: requesting to install python3-module-click-didyoumean (unspec'd ver; inspect with Debug::pkgMark-shallow)
[i586] MI2a: marked for install (shallow): python3-module-click-didyoumean
[i586] MI2a: satisfying Depends: python3(click_plugins) < 0
[i586] MI2a: maybe install (a providing target): python3-module-click-plugins 1.1.1-alt1:sisyphus+336348.100.1.1 at 1702395075
[i586] MI2a: target SELECTED: python3-module-click-plugins 1.1.1-alt1:sisyphus+336348.100.1.1 at 1702395075
[i586] MI2a: requesting to install python3-module-click-plugins (unspec'd ver; inspect with Debug::pkgMark-shallow)
[i586] MI2a: marked for install (shallow): python3-module-click-plugins
[i586] MI2a: satisfying Depends: python3(click_repl) < 0
[i586] MI2a: maybe install (a providing target): python3-module-click-repl 0.3.0-alt2:sisyphus+359306.100.1.1 at 1728411020
[i586] MI2a: target SELECTED: python3-module-click-repl 0.3.0-alt2:sisyphus+359306.100.1.1 at 1728411020
[i586] MI2a: requesting to install python3-module-click-repl (unspec'd ver; inspect with Debug::pkgMark-shallow)
[i586] MI2a: marked for install (shallow): python3-module-click-repl
[i586] MI2a: satisfying Depends: python3-module-prompt_toolkit (NULL)
[i586] MI2a: maybe install (a direct target): python3-module-prompt_toolkit 3.0.50-alt1:sisyphus+370845.100.1.1 at 1737549300
[i586] MI2a: target SELECTED: python3-module-prompt_toolkit 3.0.50-alt1:sisyphus+370845.100.1.1 at 1737549300
[i586] MI2a: requesting to install python3-module-prompt_toolkit (unspec'd ver; inspect with Debug::pkgMark-shallow)
[i586] MI2a: marked for install (shallow): python3-module-prompt_toolkit
[i586] MI2a: satisfying Depends: python3(asyncssh) < 0
[i586] MI2a: maybe install (a providing target): python3-module-asyncssh 2.20.0-alt1:sisyphus+376138.100.1.1 at 1740553689
[i586] MI2a: target SELECTED: python3-module-asyncssh 2.20.0-alt1:sisyphus+376138.100.1.1 at 1740553689
[i586] MI2a: requesting to install python3-module-asyncssh (unspec'd ver; inspect with Debug::pkgMark-shallow)
[i586] MI2a: marked for install (shallow): python3-module-asyncssh
[i586] MI2a: satisfying Depends: python3-module-Crypto (NULL)
[i586] MI2a: maybe install (a providing target): python3-module-pycryptodome 3.22.0-alt1:sisyphus+378294.100.1.1 at 1742210247
[i586] MI2a: target SELECTED: python3-module-pycryptodome 3.22.0-alt1:sisyphus+378294.100.1.1 at 1742210247
[i586] MI2a: requesting to install python3-module-pycryptodome (unspec'd ver; inspect with Debug::pkgMark-shallow)
[i586] MI2a: marked for install (shallow): python3-module-pycryptodome
[i586] MI2a: satisfying Depends: python3(gssapi) < 0
[i586] MI2a: maybe install (a providing target): python3-module-gssapi 1.9.0-alt1:sisyphus+359349.100.1.1 at 1728472734
[i586] MI2a: target SELECTED: python3-module-gssapi 1.9.0-alt1:sisyphus+359349.100.1.1 at 1728472734
[i586] MI2a: requesting to install python3-module-gssapi (unspec'd ver; inspect with Debug::pkgMark-shallow)
[i586] MI2a: marked for install (shallow): python3-module-gssapi
[i586] MI2a: satisfying Depends: python3-module-decorator (NULL)
[i586] MI2a: maybe install (a direct target): python3-module-decorator 5.2.1-alt1:sisyphus+376067.100.1.1 at 1740491622
[i586] MI2a: target SELECTED: python3-module-decorator 5.2.1-alt1:sisyphus+376067.100.1.1 at 1740491622
[i586] MI2a: requesting to install python3-module-decorator (unspec'd ver; inspect with Debug::pkgMark-shallow)
[i586] MI2a: marked for install (shallow): python3-module-decorator
[i586] MI2a: satisfying Depends: python3(pyperclip) < 0
[i586] MI2a: maybe install (a providing target): python3-module-pyperclip 1.9.0-alt1:sisyphus+353859.100.1.1 at 1722231798
[i586] MI2a: target SELECTED: python3-module-pyperclip 1.9.0-alt1:sisyphus+353859.100.1.1 at 1722231798
[i586] MI2a: requesting to install python3-module-pyperclip (unspec'd ver; inspect with Debug::pkgMark-shallow)
[i586] MI2a: marked for install (shallow): python3-module-pyperclip
[i586] MI2a: satisfying Depends: python3(wcwidth) < 0
[i586] MI2a: maybe install (a providing target): python3-module-wcwidth 0.2.13-alt1:sisyphus+341792.100.2.1 at 1709543329
[i586] MI2a: target SELECTED: python3-module-wcwidth 0.2.13-alt1:sisyphus+341792.100.2.1 at 1709543329
[i586] MI2a: requesting to install python3-module-wcwidth (unspec'd ver; inspect with Debug::pkgMark-shallow)
[i586] MI2a: marked for install (shallow): python3-module-wcwidth
[i586] MI2a: satisfying Depends: python3(curses) < 0
[i586] MI2a: maybe install (a providing target): python3-modules-curses 3.12.9-alt1:sisyphus+376344.100.1.1 at 1740742068
[i586] MI2a: target SELECTED: python3-modules-curses 3.12.9-alt1:sisyphus+376344.100.1.1 at 1740742068
[i586] MI2a: requesting to install python3-modules-curses (unspec'd ver; inspect with Debug::pkgMark-shallow)
[i586] MI2a: marked for install (shallow): python3-modules-curses
[i586] MI2a: satisfying Depends: python3(pytest) < 0
[i586] MI2a: maybe install (a providing target): python3-module-pytest 8.3.5-alt1:sisyphus+376824.100.2.1 at 1741167719
[i586] MI2a: target SELECTED: python3-module-pytest 8.3.5-alt1:sisyphus+376824.100.2.1 at 1741167719
[i586] MI2a: requesting to install python3-module-pytest (unspec'd ver; inspect with Debug::pkgMark-shallow)
[i586] MI2a: marked for install (shallow): python3-module-pytest
[i586] MI2a: satisfying Depends: python3-module-iniconfig (NULL)
[i586] MI2a: maybe install (a direct target): python3-module-iniconfig 2.1.0-alt1:sisyphus+378658.100.2.1 at 1742493599
[i586] MI2a: target SELECTED: python3-module-iniconfig 2.1.0-alt1:sisyphus+378658.100.2.1 at 1742493599
[i586] MI2a: requesting to install python3-module-iniconfig (unspec'd ver; inspect with Debug::pkgMark-shallow)
[i586] MI2a: marked for install (shallow): python3-module-iniconfig
[i586] MI2a: satisfying Depends: python3-module-pluggy (NULL)
[i586] MI2a: maybe install (a direct target): python3-module-pluggy 1.5.0-alt1:sisyphus+345632.100.2.1 at 1713864244
[i586] MI2a: target SELECTED: python3-module-pluggy 1.5.0-alt1:sisyphus+345632.100.2.1 at 1713864244
[i586] MI2a: requesting to install python3-module-pluggy (unspec'd ver; inspect with Debug::pkgMark-shallow)
[i586] MI2a: marked for install (shallow): python3-module-pluggy
[i586] MI2a: satisfying Depends: python3(django.conf) < 0
[i586] MI2a: maybe install (a providing target): python3-module-django 5.1.7-alt1:sisyphus+377889.100.1.1 at 1742236179
[i586] MI2a: target SELECTED: python3-module-django 5.1.7-alt1:sisyphus+377889.100.1.1 at 1742236179
[i586] MI2a: requesting to install python3-module-django (unspec'd ver; inspect with Debug::pkgMark-shallow)
[i586] MI2a: marked for install (shallow): python3-module-django
[i586] MI2a: satisfying Depends: python3(sqlparse) < 0
[i586] MI2a: maybe install (a providing target): python3-module-sqlparse 0.5.3-alt1:sisyphus+367438.100.1.1 at 1735561443
[i586] MI2a: target SELECTED: python3-module-sqlparse 0.5.3-alt1:sisyphus+367438.100.1.1 at 1735561443
[i586] MI2a: requesting to install python3-module-sqlparse (unspec'd ver; inspect with Debug::pkgMark-shallow)
[i586] MI2a: marked for install (shallow): python3-module-sqlparse
[i586] MI2a: satisfying Depends: python3(yaml) < 0
[i586] MI2a: maybe install (a providing target): python3-module-yaml 6.0.2-alt1:sisyphus+356896.100.1.1 at 1725541114
[i586] MI2a: target SELECTED: python3-module-yaml 6.0.2-alt1:sisyphus+356896.100.1.1 at 1725541114
[i586] MI2a: requesting to install python3-module-yaml (unspec'd ver; inspect with Debug::pkgMark-shallow)
[i586] MI2a: marked for install (shallow): python3-module-yaml
[i586] MI2a: satisfying Depends: libyaml-0.so.2 >= set:jeDuSUAbEuz1xrY3muBZ56F9Jbi2W3kR6iB5oRQxGfDDGyazcKxJ4shcJWS8IVb7
[i586] MI2a: maybe install (a providing target): libyaml2 0.2.5-alt1:sisyphus+278391.100.1.1 at 1626094932
[i586] MI2a: target SELECTED: libyaml2 0.2.5-alt1:sisyphus+278391.100.1.1 at 1626094932
[i586] MI2a: requesting to install libyaml2 (unspec'd ver; inspect with Debug::pkgMark-shallow)
[i586] MI2a: marked for install (shallow): libyaml2
[i586] MI2a: satisfying Depends: python3-module-django-dbbackend-postgresql = 5.1.7-alt1:sisyphus+377889.100.1.1
[i586] MI2a: maybe install (a direct target): python3-module-django-dbbackend-postgresql 5.1.7-alt1:sisyphus+377889.100.1.1 at 1742236179
[i586] MI2a: target SELECTED: python3-module-django-dbbackend-postgresql 5.1.7-alt1:sisyphus+377889.100.1.1 at 1742236179
[i586] MI2a: requesting to install python3-module-django-dbbackend-postgresql (unspec'd ver; inspect with Debug::pkgMark-shallow)
[i586] MI2a: marked for install (shallow): python3-module-django-dbbackend-postgresql
[i586] MI2a: satisfying Depends: python3(exam) < 0
[i586] MI2a: maybe install (a providing target): python3-module-exam 0.10.6-alt5:sisyphus+338696.100.1.1 at 1705980836
[i586] MI2a: target SELECTED: python3-module-exam 0.10.6-alt5:sisyphus+338696.100.1.1 at 1705980836
[i586] MI2a: requesting to install python3-module-exam (unspec'd ver; inspect with Debug::pkgMark-shallow)
[i586] MI2a: marked for install (shallow): python3-module-exam
[i586] MI2a: satisfying Depends: python3(flask.signals) < 0
[i586] MI2a: maybe install (a providing target): python3-module-flask 3.1.0-alt1:sisyphus+362571.400.7.1 at 1734000837
[i586] MI2a: target SELECTED: python3-module-flask 3.1.0-alt1:sisyphus+362571.400.7.1 at 1734000837
[i586] MI2a: requesting to install python3-module-flask (unspec'd ver; inspect with Debug::pkgMark-shallow)
[i586] MI2a: marked for install (shallow): python3-module-flask
[i586] MI2a: satisfying Depends: python3-module-itsdangerous (NULL)
[i586] MI2a: maybe install (a direct target): python3-module-itsdangerous 2.2.0-alt1:sisyphus+345793.200.2.1 at 1714032239
[i586] MI2a: target SELECTED: python3-module-itsdangerous 2.2.0-alt1:sisyphus+345793.200.2.1 at 1714032239
[i586] MI2a: requesting to install python3-module-itsdangerous (unspec'd ver; inspect with Debug::pkgMark-shallow)
[i586] MI2a: marked for install (shallow): python3-module-itsdangerous
[i586] MI2a: satisfying Depends: python3-module-werkzeug (NULL)
[i586] MI2a: maybe install (a direct target): python3-module-werkzeug 3.1.3-alt1:sisyphus+361875.200.2.1 at 1731337173
[i586] MI2a: target SELECTED: python3-module-werkzeug 3.1.3-alt1:sisyphus+361875.200.2.1 at 1731337173
[i586] MI2a: requesting to install python3-module-werkzeug (unspec'd ver; inspect with Debug::pkgMark-shallow)
[i586] MI2a: marked for install (shallow): python3-module-werkzeug
[i586] MI2a: satisfying Depends: python3(web) < 0
[i586] MI2a: maybe install (a providing target): python3-module-webpy 0.62-alt1:sisyphus+291589.100.1.1 at 1638900041
[i586] MI2a: target SELECTED: python3-module-webpy 0.62-alt1:sisyphus+291589.100.1.1 at 1638900041
[i586] MI2a: requesting to install python3-module-webpy (unspec'd ver; inspect with Debug::pkgMark-shallow)
[i586] MI2a: marked for install (shallow): python3-module-webpy
[i586] MI2a: satisfying Depends: python3(uvicorn.config) < 0
[i586] MI2a: maybe install (a providing target): python3-module-uvicorn 0.32.0-alt1:sisyphus+362344.100.1.2 at 1731416048
[i586] MI2a: target SELECTED: python3-module-uvicorn 0.32.0-alt1:sisyphus+362344.100.1.2 at 1731416048
[i586] MI2a: requesting to install python3-module-uvicorn (unspec'd ver; inspect with Debug::pkgMark-shallow)
[i586] MI2a: marked for install (shallow): python3-module-uvicorn
[i586] MI2a: satisfying Depends: python3(h11) < 0
[i586] MI2a: maybe install (a providing target): python3-module-h11 0.14.0-alt1:sisyphus+312690.100.1.1 at 1672395335
[i586] MI2a: target SELECTED: python3-module-h11 0.14.0-alt1:sisyphus+312690.100.1.1 at 1672395335
[i586] MI2a: requesting to install python3-module-h11 (unspec'd ver; inspect with Debug::pkgMark-shallow)
[i586] MI2a: marked for install (shallow): python3-module-h11
[i586] MI2a: satisfying Depends: python3(httptools) < 0
[i586] MI2a: maybe install (a providing target): python3-module-httptools 0.6.4-alt1:sisyphus+360443.100.1.1 at 1729609753
[i586] MI2a: target SELECTED: python3-module-httptools 0.6.4-alt1:sisyphus+360443.100.1.1 at 1729609753
[i586] MI2a: requesting to install python3-module-httptools (unspec'd ver; inspect with Debug::pkgMark-shallow)
[i586] MI2a: marked for install (shallow): python3-module-httptools
[i586] MI2a: satisfying Depends: libhttp_parser.so.2.9 >= set:hfh6pK1
[i586] MI2a: maybe install (a providing target): libhttp-parser 2.9.4-alt2:sisyphus+279479.100.1.1 at 1626549242
[i586] MI2a: target SELECTED: libhttp-parser 2.9.4-alt2:sisyphus+279479.100.1.1 at 1626549242
[i586] MI2a: requesting to install libhttp-parser (unspec'd ver; inspect with Debug::pkgMark-shallow)
[i586] MI2a: marked for install (shallow): libhttp-parser
[i586] MI2a: satisfying Depends: python3(uvloop) < 0
[i586] MI2a: maybe install (a providing target): python3-module-uvloop 0.21.0-alt2:sisyphus+360737.200.1.1 at 1730313531
[i586] MI2a: target SELECTED: python3-module-uvloop 0.21.0-alt2:sisyphus+360737.200.1.1 at 1730313531
[i586] MI2a: requesting to install python3-module-uvloop (unspec'd ver; inspect with Debug::pkgMark-shallow)
[i586] MI2a: marked for install (shallow): python3-module-uvloop
[i586] MI2a: satisfying Depends: python3(watchfiles) < 0
[i586] MI2a: maybe install (a providing target): python3-module-watchfiles 0.21.0-alt2:sisyphus+345606.100.1.1 at 1713774131
[i586] MI2a: target SELECTED: python3-module-watchfiles 0.21.0-alt2:sisyphus+345606.100.1.1 at 1713774131
[i586] MI2a: requesting to install python3-module-watchfiles (unspec'd ver; inspect with Debug::pkgMark-shallow)
[i586] MI2a: marked for install (shallow): python3-module-watchfiles
[i586] MI2a: satisfying Depends: python3(anyio) < 0
[i586] MI2a: maybe install (a providing target): python3-module-anyio 4.8.0-alt2:sisyphus+376617.100.1.1 at 1740870933
[i586] MI2a: target SELECTED: python3-module-anyio 4.8.0-alt2:sisyphus+376617.100.1.1 at 1740870933
[i586] MI2a: requesting to install python3-module-anyio (unspec'd ver; inspect with Debug::pkgMark-shallow)
[i586] MI2a: marked for install (shallow): python3-module-anyio
[i586] MI2a: satisfying Depends: python3(watchgod) < 0
[i586] MI2a: maybe install (a providing target): python3-module-watchgod 0.7-alt1:sisyphus+266224.300.1.1 at 1613128283
[i586] MI2a: target SELECTED: python3-module-watchgod 0.7-alt1:sisyphus+266224.300.1.1 at 1613128283
[i586] MI2a: requesting to install python3-module-watchgod (unspec'd ver; inspect with Debug::pkgMark-shallow)
[i586] MI2a: marked for install (shallow): python3-module-watchgod
[i586] MI2a: satisfying Depends: python3(websockets) < 0
[i586] MI2a: maybe install (a providing target): python3-module-websockets 14.1-alt1:sisyphus+369527.100.1.1 at 1736868330
[i586] MI2a: target SELECTED: python3-module-websockets 14.1-alt1:sisyphus+369527.100.1.1 at 1736868330
[i586] MI2a: requesting to install python3-module-websockets (unspec'd ver; inspect with Debug::pkgMark-shallow)
[i586] MI2a: marked for install (shallow): python3-module-websockets
[i586] MI2a: satisfying Depends: python3(wsproto) < 0
[i586] MI2a: maybe install (a providing target): python3-module-wsproto 1.2.0-alt1:sisyphus+309644.100.1.2 at 1667834502
[i586] MI2a: target SELECTED: python3-module-wsproto 1.2.0-alt1:sisyphus+309644.100.1.2 at 1667834502
[i586] MI2a: requesting to install python3-module-wsproto (unspec'd ver; inspect with Debug::pkgMark-shallow)
[i586] MI2a: marked for install (shallow): python3-module-wsproto
[i586] rpm-build-pyproject is already the newest version.
[i586] E: Couldn't find package python3-module-markdown-pytest
[i586] hsh-install: Failed to calculate package file list.
[i586] hsh-install: Failed to generate package file list.
2025-Apr-02 15:13:38 :: [i586] python3-module-aiofile.git 3.9.0-alt1: remote: cannot build src.rpm
2025-Apr-02 15:13:38 :: [i586] #500 python3-module-aiofile.git 3.9.0-alt1: build FAILED
2025-Apr-02 15:13:38 :: [i586] requesting cancellation of task processing
[x86_64] <13>Apr 2 15:13:39 rpmi: libmpdec3-2.5.1-alt3 sisyphus+314490.500.5.1 1675432004 installed
[x86_64] <13>Apr 2 15:13:39 rpmi: libgdbm-1.8.3-alt10 sisyphus+346222.200.3.2 1716468404 installed
[x86_64] <13>Apr 2 15:13:39 rpmi: libexpat-2.7.1-alt1 sisyphus+379929.100.1.1 1743519381 installed
[x86_64] <13>Apr 2 15:13:39 rpmi: openssl-config-3.2.0-alt1 sisyphus+366659.140.4.1 1736956949 installed
[x86_64] <13>Apr 2 15:13:39 rpmi: libb2-0.98.1-alt1_1 sisyphus+291614.100.1.1 1638962877 installed
[x86_64] <13>Apr 2 15:13:39 rpmi: libp11-kit-1:0.25.5-alt1 sisyphus+352553.100.1.1 1720622573 installed
[x86_64] <13>Apr 2 15:13:39 rpmi: libtasn1-4.20.0-alt2 sisyphus+375829.100.1.1 1740299335 installed
[x86_64] <13>Apr 2 15:13:39 rpmi: rpm-macros-alternatives-0.5.3-alt1 sisyphus+371878.100.1.1 1737988822 installed
[x86_64] <13>Apr 2 15:13:39 rpmi: alternatives-0.5.3-alt1 sisyphus+371878.100.1.1 1737988822 installed
[x86_64] <13>Apr 2 15:13:39 rpmi: ca-certificates-2025.02.10-alt1 sisyphus+374228.100.4.1 1739265441 installed
[x86_64] <13>Apr 2 15:13:39 rpmi: ca-trust-0.2.0-alt1 sisyphus+344843.100.1.1 1712743326 installed
[x86_64] <13>Apr 2 15:13:39 rpmi: p11-kit-trust-1:0.25.5-alt1 sisyphus+352553.100.1.1 1720622573 installed
[x86_64] <13>Apr 2 15:13:39 rpmi: libcrypto3-3.3.3-alt1 sisyphus+374381.40.2.1 1739299401 installed
[x86_64] <13>Apr 2 15:13:39 rpmi: libssl3-3.3.3-alt1 sisyphus+374381.40.2.1 1739299401 installed
[x86_64] <13>Apr 2 15:13:40 rpmi: python3-3.12.9-alt1 sisyphus+376344.100.1.1 1740741913 installed
[x86_64] <13>Apr 2 15:13:40 rpmi: python3-base-3.12.9-alt1 sisyphus+376344.100.1.1 1740741913 installed
[x86_64] <13>Apr 2 15:13:40 rpmi: python3-module-py3dephell-0.3.1-alt1 sisyphus+365261.200.1.1 1734463433 installed
[x86_64] <13>Apr 2 15:13:40 rpmi: python3-module-pyproject-installer-0.5.5-alt2 sisyphus+366395.100.1.1 1735032014 installed
[x86_64] <13>Apr 2 15:13:40 rpmi: rpm-macros-pyproject-0.0.9-alt1 sisyphus+362541.300.2.1 1731671840 installed
[x86_64] <13>Apr 2 15:13:40 rpmi: tests-for-installed-python3-pkgs-0.1.28-alt1 sisyphus+375953.100.2.1 1740855713 installed
[x86_64] <13>Apr 2 15:13:40 rpmi: rpm-build-python3-0.1.28-alt1 sisyphus+375953.100.2.1 1740855713 installed
[x86_64] <13>Apr 2 15:13:40 rpmi: rpm-build-pyproject-0.0.9-alt1 sisyphus+362541.300.2.1 1731671840 installed
[x86_64] Reading Package Lists...
[x86_64] Building Dependency Tree...
[x86_64] MI2a: marked for install (shallow): python3-module-poetry-core
[x86_64] MI2a: satisfying Depends: python3(poetry) < 0
[x86_64] MI2a: maybe install (a providing target): python3-module-poetry-alt-namespace 0.0.1-alt1:sisyphus+306728.100.1.1 at 1663083686
[x86_64] MI2a: target SELECTED: python3-module-poetry-alt-namespace 0.0.1-alt1:sisyphus+306728.100.1.1 at 1663083686
[x86_64] MI2a: requesting to install python3-module-poetry-alt-namespace (unspec'd ver; inspect with Debug::pkgMark-shallow)
[x86_64] MI2a: marked for install (shallow): python3-module-poetry-alt-namespace
[x86_64] MI2a: satisfying Depends: python3-module-fastjsonschema (NULL)
[x86_64] MI2a: maybe install (a direct target): python3-module-fastjsonschema 2.21.1-alt1:sisyphus+363956.100.1.1 at 1733217943
[x86_64] MI2a: target SELECTED: python3-module-fastjsonschema 2.21.1-alt1:sisyphus+363956.100.1.1 at 1733217943
[x86_64] MI2a: requesting to install python3-module-fastjsonschema (unspec'd ver; inspect with Debug::pkgMark-shallow)
[x86_64] MI2a: marked for install (shallow): python3-module-fastjsonschema
[x86_64] MI2a: satisfying Depends: python3-module-lark (NULL)
[x86_64] MI2a: maybe install (a direct target): python3-module-lark 1.2.2-alt1:sisyphus+358322.100.1.1 at 1727258177
[x86_64] MI2a: target SELECTED: python3-module-lark 1.2.2-alt1:sisyphus+358322.100.1.1 at 1727258177
[x86_64] MI2a: requesting to install python3-module-lark (unspec'd ver; inspect with Debug::pkgMark-shallow)
[x86_64] MI2a: marked for install (shallow): python3-module-lark
[x86_64] MI2a: satisfying Depends: python3-module-packaging (NULL)
[x86_64] MI2a: maybe install (a direct target): python3-module-packaging 24.2-alt1:sisyphus+362183.100.1.1 at 1731315992
[x86_64] MI2a: target SELECTED: python3-module-packaging 24.2-alt1:sisyphus+362183.100.1.1 at 1731315992
[x86_64] MI2a: requesting to install python3-module-packaging (unspec'd ver; inspect with Debug::pkgMark-shallow)
[x86_64] MI2a: marked for install (shallow): python3-module-packaging
[x86_64] MI2a: satisfying Depends: python3-module-tomli (NULL)
[x86_64] MI2a: maybe install (a direct target): python3-module-tomli 2.2.1-alt1:sisyphus+363592.100.1.1 at 1732803942
[x86_64] MI2a: target SELECTED: python3-module-tomli 2.2.1-alt1:sisyphus+363592.100.1.1 at 1732803942
[x86_64] MI2a: requesting to install python3-module-tomli (unspec'd ver; inspect with Debug::pkgMark-shallow)
[x86_64] MI2a: marked for install (shallow): python3-module-tomli
[x86_64] MI2a: marked for install (shallow): python3-module-aiomisc-pytest
[x86_64] MI2a: satisfying Depends: python3-module-aiomisc (NULL)
[x86_64] MI2a: maybe install (a direct target): python3-module-aiomisc 17.7.7-alt1:sisyphus+380033.200.2.1 at 1743606735
[x86_64] MI2a: target SELECTED: python3-module-aiomisc 17.7.7-alt1:sisyphus+380033.200.2.1 at 1743606735
[x86_64] MI2a: requesting to install python3-module-aiomisc (unspec'd ver; inspect with Debug::pkgMark-shallow)
[x86_64] MI2a: marked for install (shallow): python3-module-aiomisc
[x86_64] MI2a: satisfying Depends: python3-module-colorlog (NULL)
[x86_64] MI2a: maybe install (a direct target): python3-module-colorlog 6.9.0-alt1:sisyphus+361147.100.1.1 at 1730276596
[x86_64] MI2a: target SELECTED: python3-module-colorlog 6.9.0-alt1:sisyphus+361147.100.1.1 at 1730276596
[x86_64] MI2a: requesting to install python3-module-colorlog (unspec'd ver; inspect with Debug::pkgMark-shallow)
[x86_64] MI2a: marked for install (shallow): python3-module-colorlog
[x86_64] MI2a: satisfying Depends: python3-module-logging-journald (NULL)
[x86_64] MI2a: maybe install (a direct target): python3-module-logging-journald 0.6.11-alt1:sisyphus+379065.100.1.1 at 1742804085
[x86_64] MI2a: target SELECTED: python3-module-logging-journald 0.6.11-alt1:sisyphus+379065.100.1.1 at 1742804085
[x86_64] MI2a: requesting to install python3-module-logging-journald (unspec'd ver; inspect with Debug::pkgMark-shallow)
[x86_64] MI2a: marked for install (shallow): python3-module-logging-journald
[x86_64] MI2a: satisfying Depends: python3(aiocarbon.protocol.pickle) < 0
[x86_64] MI2a: maybe install (a providing target): python3-module-aiocarbon 0.15.3-alt1:sisyphus+330385.200.1.1 at 1695726415
[x86_64] MI2a: target SELECTED: python3-module-aiocarbon 0.15.3-alt1:sisyphus+330385.200.1.1 at 1695726415
[x86_64] MI2a: requesting to install python3-module-aiocarbon (unspec'd ver; inspect with Debug::pkgMark-shallow)
[x86_64] MI2a: marked for install (shallow): python3-module-aiocarbon
[x86_64] MI2a: satisfying Depends: python3-module-immutables (NULL)
[x86_64] MI2a: maybe install (a direct target): python3-module-immutables 0.20-alt1:sisyphus+333513.74200.74.1 at 1704728199
[x86_64] MI2a: target SELECTED: python3-module-immutables 0.20-alt1:sisyphus+333513.74200.74.1 at 1704728199
[x86_64] MI2a: requesting to install python3-module-immutables (unspec'd ver; inspect with Debug::pkgMark-shallow)
[x86_64] MI2a: marked for install (shallow): python3-module-immutables
[x86_64] MI2a: satisfying Depends: python3(aiohttp) < 0
[x86_64] MI2a: maybe install (a providing target): python3-module-aiohttp 3.11.13-alt1:sisyphus+377836.100.1.1 at 1741868189
[x86_64] MI2a: target SELECTED: python3-module-aiohttp 3.11.13-alt1:sisyphus+377836.100.1.1 at 1741868189
[x86_64] MI2a: requesting to install python3-module-aiohttp (unspec'd ver; inspect with Debug::pkgMark-shallow)
[x86_64] MI2a: marked for install (shallow): python3-module-aiohttp
[x86_64] MI2a: satisfying Depends: python3(aiohappyeyeballs) < 0
[x86_64] MI2a: maybe install (a providing target): python3-module-aiohappyeyeballs 2.4.4-alt1:sisyphus+369620.100.1.1 at 1736938218
[x86_64] MI2a: target SELECTED: python3-module-aiohappyeyeballs 2.4.4-alt1:sisyphus+369620.100.1.1 at 1736938218
[x86_64] MI2a: requesting to install python3-module-aiohappyeyeballs (unspec'd ver; inspect with Debug::pkgMark-shallow)
[x86_64] MI2a: marked for install (shallow): python3-module-aiohappyeyeballs
[x86_64] MI2a: satisfying Depends: python3(aiosignal) < 0
[x86_64] MI2a: maybe install (a providing target): python3-module-aiosignal 1.3.2-alt1:sisyphus+369480.100.1.1 at 1736854528
[x86_64] MI2a: target SELECTED: python3-module-aiosignal 1.3.2-alt1:sisyphus+369480.100.1.1 at 1736854528
[x86_64] MI2a: requesting to install python3-module-aiosignal (unspec'd ver; inspect with Debug::pkgMark-shallow)
[x86_64] MI2a: marked for install (shallow): python3-module-aiosignal
[x86_64] MI2a: satisfying Depends: python3(frozenlist) < 0
[x86_64] MI2a: maybe install (a providing target): python3-module-frozenlist 1.5.0-alt1:sisyphus+362047.100.1.1 at 1731079173
[x86_64] MI2a: target SELECTED: python3-module-frozenlist 1.5.0-alt1:sisyphus+362047.100.1.1 at 1731079173
[x86_64] MI2a: requesting to install python3-module-frozenlist (unspec'd ver; inspect with Debug::pkgMark-shallow)
[x86_64] MI2a: marked for install (shallow): python3-module-frozenlist
[x86_64] MI2a: satisfying Depends: python3(attr) < 0
[x86_64] MI2a: maybe install (a providing target): python3-module-attrs 25.3.0-alt1:sisyphus+378700.100.1.1 at 1742472992
[x86_64] MI2a: target SELECTED: python3-module-attrs 25.3.0-alt1:sisyphus+378700.100.1.1 at 1742472992
[x86_64] MI2a: requesting to install python3-module-attrs (unspec'd ver; inspect with Debug::pkgMark-shallow)
[x86_64] MI2a: marked for install (shallow): python3-module-attrs
[x86_64] MI2a: satisfying Depends: python3(gunicorn.config) < 0
[x86_64] MI2a: maybe install (a providing target): python3-module-gunicorn 23.0.0-alt1:sisyphus+362920.200.1.1 at 1732021917
[x86_64] MI2a: target SELECTED: python3-module-gunicorn 23.0.0-alt1:sisyphus+362920.200.1.1 at 1732021917
[x86_64] MI2a: requesting to install python3-module-gunicorn (unspec'd ver; inspect with Debug::pkgMark-shallow)
[x86_64] MI2a: marked for install (shallow): python3-module-gunicorn
[x86_64] MI2a: satisfying Depends: python3(eventlet) < 0
[x86_64] MI2a: maybe install (a providing target): python3-module-eventlet 0.39.1-alt1:sisyphus+377102.100.1.1 at 1741275965
[x86_64] MI2a: target SELECTED: python3-module-eventlet 0.39.1-alt1:sisyphus+377102.100.1.1 at 1741275965
[x86_64] MI2a: requesting to install python3-module-eventlet (unspec'd ver; inspect with Debug::pkgMark-shallow)
[x86_64] MI2a: marked for install (shallow): python3-module-eventlet
[x86_64] MI2a: satisfying Depends: python3-module-dns (NULL)
[x86_64] MI2a: maybe install (a direct target): python3-module-dns 1:2.6.1-alt1:sisyphus+341811.20.3.1 at 1709382170
[x86_64] MI2a: target SELECTED: python3-module-dns 1:2.6.1-alt1:sisyphus+341811.20.3.1 at 1709382170
[x86_64] MI2a: requesting to install python3-module-dns (unspec'd ver; inspect with Debug::pkgMark-shallow)
[x86_64] MI2a: marked for install (shallow): python3-module-dns
[x86_64] MI2a: satisfying Depends: python3(cryptography.hazmat.backends) < 0
[x86_64] MI2a: maybe install (a providing target): python3-module-cryptography 44.0.0-alt1:sisyphus+368451.100.1.1 at 1736436050
[x86_64] MI2a: target SELECTED: python3-module-cryptography 44.0.0-alt1:sisyphus+368451.100.1.1 at 1736436050
[x86_64] MI2a: requesting to install python3-module-cryptography (unspec'd ver; inspect with Debug::pkgMark-shallow)
[x86_64] MI2a: marked for install (shallow): python3-module-cryptography
[x86_64] MI2a: satisfying Depends: python3(cffi) < 0
[x86_64] MI2a: maybe install (a providing target): python3-module-cffi 1.17.1-alt1:sisyphus+357396.100.1.1 at 1726156476
[x86_64] MI2a: target SELECTED: python3-module-cffi 1.17.1-alt1:sisyphus+357396.100.1.1 at 1726156476
[x86_64] MI2a: requesting to install python3-module-cffi (unspec'd ver; inspect with Debug::pkgMark-shallow)
[x86_64] MI2a: marked for install (shallow): python3-module-cffi
[x86_64] MI2a: satisfying Depends: python3-module-pycparser (NULL)
[x86_64] MI2a: maybe install (a direct target): python3-module-pycparser 2.22-alt1:sisyphus+378485.100.1.1 at 1742331206
[x86_64] MI2a: target SELECTED: python3-module-pycparser 2.22-alt1:sisyphus+378485.100.1.1 at 1742331206
[x86_64] MI2a: requesting to install python3-module-pycparser (unspec'd ver; inspect with Debug::pkgMark-shallow)
[x86_64] MI2a: marked for install (shallow): python3-module-pycparser
[x86_64] MI2a: satisfying Depends: python3(trio) < 0
[x86_64] MI2a: maybe install (a providing target): python3-module-trio 0.29.0-alt1:sisyphus+376073.100.1.1 at 1740492646
[x86_64] MI2a: target SELECTED: python3-module-trio 0.29.0-alt1:sisyphus+376073.100.1.1 at 1740492646
[x86_64] MI2a: requesting to install python3-module-trio (unspec'd ver; inspect with Debug::pkgMark-shallow)
[x86_64] MI2a: marked for install (shallow): python3-module-trio
[x86_64] MI2a: satisfying Depends: python3(astor) < 0
[x86_64] MI2a: maybe install (a providing target): python3-module-astor 0.8.1-alt1.1:sisyphus+315877.100.1.1 at 1677481862
[x86_64] MI2a: target SELECTED: python3-module-astor 0.8.1-alt1.1:sisyphus+315877.100.1.1 at 1677481862
[x86_64] MI2a: requesting to install python3-module-astor (unspec'd ver; inspect with Debug::pkgMark-shallow)
[x86_64] MI2a: marked for install (shallow): python3-module-astor
[x86_64] MI2a: satisfying Depends: python3(idna) < 0
[x86_64] MI2a: maybe install (a providing target): python3-module-idna 3.10-alt1:sisyphus+358681.100.1.1 at 1727701241
[x86_64] MI2a: target SELECTED: python3-module-idna 3.10-alt1:sisyphus+358681.100.1.1 at 1727701241
[x86_64] MI2a: requesting to install python3-module-idna (unspec'd ver; inspect with Debug::pkgMark-shallow)
[x86_64] MI2a: marked for install (shallow): python3-module-idna
[x86_64] MI2a: satisfying Depends: python3(outcome) < 0
[x86_64] MI2a: maybe install (a providing target): python3-module-outcome 1.3.0-alt1:sisyphus+332382.100.1.1 at 1697882349
[x86_64] MI2a: target SELECTED: python3-module-outcome 1.3.0-alt1:sisyphus+332382.100.1.1 at 1697882349
[x86_64] MI2a: requesting to install python3-module-outcome (unspec'd ver; inspect with Debug::pkgMark-shallow)
[x86_64] MI2a: marked for install (shallow): python3-module-outcome
[x86_64] MI2a: satisfying Depends: python3(sniffio) < 0
[x86_64] MI2a: maybe install (a providing target): python3-module-sniffio 1.3.1-alt1:sisyphus+341424.100.1.1 at 1708941879
[x86_64] MI2a: target SELECTED: python3-module-sniffio 1.3.1-alt1:sisyphus+341424.100.1.1 at 1708941879
[x86_64] MI2a: requesting to install python3-module-sniffio (unspec'd ver; inspect with Debug::pkgMark-shallow)
[x86_64] MI2a: marked for install (shallow): python3-module-sniffio
[x86_64] MI2a: satisfying Depends: python3(sortedcontainers) < 0
[x86_64] MI2a: maybe install (a providing target): python3-module-sortedcontainers 2.4.0-alt1:sisyphus+272042.100.1.1 at 1621262424
[x86_64] MI2a: target SELECTED: python3-module-sortedcontainers 2.4.0-alt1:sisyphus+272042.100.1.1 at 1621262424
[x86_64] MI2a: requesting to install python3-module-sortedcontainers (unspec'd ver; inspect with Debug::pkgMark-shallow)
[x86_64] MI2a: marked for install (shallow): python3-module-sortedcontainers
[x86_64] MI2a: satisfying Depends: python3-module-greenlet (NULL)
[x86_64] MI2a: maybe install (a direct target): python3-module-greenlet 3.1.1-alt1:sisyphus+358881.100.1.1 at 1727933137
[x86_64] MI2a: target SELECTED: python3-module-greenlet 3.1.1-alt1:sisyphus+358881.100.1.1 at 1727933137
[x86_64] MI2a: requesting to install python3-module-greenlet (unspec'd ver; inspect with Debug::pkgMark-shallow)
[x86_64] MI2a: marked for install (shallow): python3-module-greenlet
[x86_64] MI2a: satisfying Depends: python3(objgraph) < 0
[x86_64] MI2a: maybe install (a providing target): python3-module-objgraph 3.6.2-alt1:sisyphus+359468.100.1.1 at 1728573508
[x86_64] MI2a: target SELECTED: python3-module-objgraph 3.6.2-alt1:sisyphus+359468.100.1.1 at 1728573508
[x86_64] MI2a: requesting to install python3-module-objgraph (unspec'd ver; inspect with Debug::pkgMark-shallow)
[x86_64] MI2a: marked for install (shallow): python3-module-objgraph
[x86_64] MI2a: satisfying Depends: python3(psutil) < 0
[x86_64] MI2a: maybe install (a providing target): python3-module-psutil 7.0.0-alt1:sisyphus+378483.100.1.1 at 1742330008
[x86_64] MI2a: target SELECTED: python3-module-psutil 7.0.0-alt1:sisyphus+378483.100.1.1 at 1742330008
[x86_64] MI2a: requesting to install python3-module-psutil (unspec'd ver; inspect with Debug::pkgMark-shallow)
[x86_64] MI2a: marked for install (shallow): python3-module-psutil
[x86_64] MI2a: satisfying Depends: python3(OpenSSL) < 0
[x86_64] MI2a: maybe install (a providing target): python3-module-openssl 24.3.0-alt1:sisyphus+368451.200.1.1 at 1736436083
[x86_64] MI2a: target SELECTED: python3-module-openssl 24.3.0-alt1:sisyphus+368451.200.1.1 at 1736436083
[x86_64] MI2a: requesting to install python3-module-openssl (unspec'd ver; inspect with Debug::pkgMark-shallow)
[x86_64] MI2a: marked for install (shallow): python3-module-openssl
[x86_64] MI2a: satisfying Depends: python3(psycopg2) < 0
[x86_64] MI2a: maybe install (a providing target): python3-module-psycopg2 2.9.10-alt1:sisyphus+361099.100.1.1 at 1730221764
[x86_64] MI2a: target SELECTED: python3-module-psycopg2 2.9.10-alt1:sisyphus+361099.100.1.1 at 1730221764
[x86_64] MI2a: requesting to install python3-module-psycopg2 (unspec'd ver; inspect with Debug::pkgMark-shallow)
[x86_64] MI2a: marked for install (shallow): python3-module-psycopg2
[x86_64] MI2a: satisfying Depends: libpq.so.5()(64bit) >= set:le0TVGKd0aLPs2Nto7Z1f8FxU3t37565zOwtmwlUaWn0dXOK7GBJfWweelDqOjusm7LJHI69oPyonkICCiZ0KE8twsNhtmDQxu1w9MNRQM6iIwtsGmhvDgb4B6QuzxLcX13wdIuoKDPIJQr4x1t1hL1zoDFNfnwrgBoGCYuEls2pCkkAe2WpTW8FwTtXB
[x86_64] MI2a: maybe install (a providing target): libpq5-17 17.4-alt2:sisyphus+379856.100.1.1 at 1743493283
[x86_64] MI2a: target SELECTED: libpq5-17 17.4-alt2:sisyphus+379856.100.1.1 at 1743493283
[x86_64] MI2a: requesting to install libpq5-17 (unspec'd ver; inspect with Debug::pkgMark-shallow)
[x86_64] MI2a: marked for install (shallow): libpq5-17
[x86_64] MI2a: satisfying Depends: libgssapi_krb5.so.2()(64bit) >= set:lherpSlTiIbj9ttXyZebz97L79n5wNyJos
[x86_64] MI2a: maybe install (a providing target): libkrb5 1.21.3-alt2:sisyphus+351857.100.1.1 at 1719735141
[x86_64] MI2a: target SELECTED: libkrb5 1.21.3-alt2:sisyphus+351857.100.1.1 at 1719735141
[x86_64] MI2a: requesting to install libkrb5 (unspec'd ver; inspect with Debug::pkgMark-shallow)
[x86_64] MI2a: marked for install (shallow): libkrb5
[x86_64] MI2a: satisfying Depends: libcom_err.so.2()(64bit) >= set:ifPl8xIvqFmQe8JQo3
[x86_64] MI2a: maybe install (a providing target): libcom_err 1.47.1.0.10.ad56-alt2:sisyphus+363497.200.3.1 at 1732729908
[x86_64] MI2a: target SELECTED: libcom_err 1.47.1.0.10.ad56-alt2:sisyphus+363497.200.3.1 at 1732729908
[x86_64] MI2a: requesting to install libcom_err (unspec'd ver; inspect with Debug::pkgMark-shallow)
[x86_64] MI2a: marked for install (shallow): libcom_err
[x86_64] MI2a: satisfying Depends: libkeyutils.so.1()(64bit) >= set:jfWn12U6KThBXgruPLZ68yYZt2
[x86_64] MI2a: maybe install (a providing target): libkeyutils 1.6.3-alt1:sisyphus+346336.200.2.2 at 1716472658
[x86_64] MI2a: target SELECTED: libkeyutils 1.6.3-alt1:sisyphus+346336.200.2.2 at 1716472658
[x86_64] MI2a: requesting to install libkeyutils (unspec'd ver; inspect with Debug::pkgMark-shallow)
[x86_64] MI2a: marked for install (shallow): libkeyutils
[x86_64] MI2a: satisfying Depends: liblmdb.so.0()(64bit) >= set:kfalKd4xYAkaAG2MqeH0wB2F4kTaBEo1iv0KFpxVmqzFIV6HJ0
[x86_64] MI2a: maybe install (a providing target): liblmdb 0.9.33-alt1:sisyphus+360625.100.1.1 at 1729819640
[x86_64] MI2a: target SELECTED: liblmdb 0.9.33-alt1:sisyphus+360625.100.1.1 at 1729819640
[x86_64] MI2a: requesting to install liblmdb (unspec'd ver; inspect with Debug::pkgMark-shallow)
[x86_64] MI2a: marked for install (shallow): liblmdb
[x86_64] MI2a: satisfying Depends: libverto.so.1()(64bit) >= set:jfI5MRvI6tmNn0zwQdb68Gk0
[x86_64] MI2a: maybe install (a providing target): libverto 0.3.2-alt1_1:sisyphus+321176.2200.10.2 at 1684803947
[x86_64] MI2a: target SELECTED: libverto 0.3.2-alt1_1:sisyphus+321176.2200.10.2 at 1684803947
[x86_64] MI2a: requesting to install libverto (unspec'd ver; inspect with Debug::pkgMark-shallow)
[x86_64] MI2a: marked for install (shallow): libverto
[x86_64] MI2a: satisfying Depends: libldap.so.2()(64bit) >= set:njqWGgifGkup62BnqbMvIeUH81G53algzrHVZd
[x86_64] MI2a: maybe install (a providing target): libldap2 2.6.9-alt2:sisyphus+367501.300.4.1 at 1735841751
[x86_64] MI2a: target SELECTED: libldap2 2.6.9-alt2:sisyphus+367501.300.4.1 at 1735841751
[x86_64] MI2a: requesting to install libldap2 (unspec'd ver; inspect with Debug::pkgMark-shallow)
[x86_64] MI2a: marked for install (shallow): libldap2
[x86_64] MI2a: satisfying Depends: libsasl2.so.3()(64bit) >= set:lhKAh7QjCM36Vnr6MdFxFf8LIcZsS1kl0wH7Iyp
[x86_64] MI2a: maybe install (a providing target): libsasl2-3 2.1.28-alt2.1:sisyphus+367419.100.1.1 at 1735482560
[x86_64] MI2a: target SELECTED: libsasl2-3 2.1.28-alt2.1:sisyphus+367419.100.1.1 at 1735482560
[x86_64] MI2a: requesting to install libsasl2-3 (unspec'd ver; inspect with Debug::pkgMark-shallow)
[x86_64] MI2a: marked for install (shallow): libsasl2-3
[x86_64] MI2a: satisfying Depends: openldap-common = 2.6.9-alt2:sisyphus+367501.300.4.1
[x86_64] MI2a: maybe install (a direct target): openldap-common 2.6.9-alt2:sisyphus+367501.300.4.1 at 1735841751
[x86_64] MI2a: target SELECTED: openldap-common 2.6.9-alt2:sisyphus+367501.300.4.1 at 1735841751
[x86_64] MI2a: requesting to install openldap-common (unspec'd ver; inspect with Debug::pkgMark-shallow)
[x86_64] MI2a: marked for install (shallow): openldap-common
[x86_64] MI2a: satisfying Depends: python3(gevent) < 0
[x86_64] MI2a: maybe install (a providing target): python3-module-gevent 24.11.1-alt1:sisyphus+378463.100.2.1 at 1742318286
[x86_64] MI2a: target SELECTED: python3-module-gevent 24.11.1-alt1:sisyphus+378463.100.2.1 at 1742318286
[x86_64] MI2a: requesting to install python3-module-gevent (unspec'd ver; inspect with Debug::pkgMark-shallow)
[x86_64] MI2a: marked for install (shallow): python3-module-gevent
[x86_64] MI2a: satisfying Depends: libcares.so.2()(64bit) >= set:njZcqOo1pMV1HaF9aNphWwXAbWWHLWEuDVBCvmRA2
[x86_64] MI2a: maybe install (a providing target): libcares 1.34.4-alt1:sisyphus+366652.100.1.1 at 1735281164
[x86_64] MI2a: target SELECTED: libcares 1.34.4-alt1:sisyphus+366652.100.1.1 at 1735281164
[x86_64] MI2a: requesting to install libcares (unspec'd ver; inspect with Debug::pkgMark-shallow)
[x86_64] MI2a: marked for install (shallow): libcares
[x86_64] MI2a: satisfying Depends: libev.so.4()(64bit) >= set:kePKyiZkErgk4oJyZD1pYiw8QUPkSlSo2oVWB4hEjYIlbFFasBbJvt9OeoFp4LMJ78Kc9UNyZkOb2wesW3ydCD7c9Y8WeSX5nuqixAjAvDr7Kfi0
[x86_64] MI2a: maybe install (a providing target): libev4 4.33-alt3:sisyphus+334335.340.4.1 at 1699912675
[x86_64] MI2a: target SELECTED: libev4 4.33-alt3:sisyphus+334335.340.4.1 at 1699912675
[x86_64] MI2a: requesting to install libev4 (unspec'd ver; inspect with Debug::pkgMark-shallow)
[x86_64] MI2a: marked for install (shallow): libev4
[x86_64] MI2a: satisfying Depends: libuv.so.1()(64bit) >= set:mgRq8px87t4QhqZzhBUt9vZwZr1vmZnmzCV5IbCLaaZLWFkE9gdw6ZprPC1KJnsOvDMmsgo2Z9Ok94PMM6TDqSIad7nY65Cd1B98abNW7RWLiTl0xdTh57Mc6j9h1bEVXhWT93buejCqXts2
[x86_64] MI2a: maybe install (a providing target): libuv 1.50.0-alt1:sisyphus+377760.100.1.1 at 1741795923
[x86_64] MI2a: target SELECTED: libuv 1.50.0-alt1:sisyphus+377760.100.1.1 at 1741795923
[x86_64] MI2a: requesting to install libuv (unspec'd ver; inspect with Debug::pkgMark-shallow)
[x86_64] MI2a: marked for install (shallow): libuv
[x86_64] MI2a: satisfying Depends: python3(zope.event) < 0
[x86_64] MI2a: maybe install (a providing target): python3-module-zope.event 5.0-alt1.1:sisyphus+325755.140.2.1 at 1690991538
[x86_64] MI2a: target SELECTED: python3-module-zope.event 5.0-alt1.1:sisyphus+325755.140.2.1 at 1690991538
[x86_64] MI2a: requesting to install python3-module-zope.event (unspec'd ver; inspect with Debug::pkgMark-shallow)
[x86_64] MI2a: marked for install (shallow): python3-module-zope.event
[x86_64] MI2a: satisfying Depends: python3(zope) < 0
[x86_64] MI2a: maybe install (a providing target): python3-module-zope 3.3.0-alt9:sisyphus+281937.200.4.1 at 1628175900
[x86_64] MI2a: target SELECTED: python3-module-zope 3.3.0-alt9:sisyphus+281937.200.4.1 at 1628175900
[x86_64] MI2a: requesting to install python3-module-zope (unspec'd ver; inspect with Debug::pkgMark-shallow)
[x86_64] MI2a: marked for install (shallow): python3-module-zope
[x86_64] MI2a: satisfying Depends: python3-module-zope.interface (NULL)
[x86_64] MI2a: maybe install (a direct target): python3-module-zope.interface 7.2-alt1:sisyphus+363572.100.1.1 at 1732797441
[x86_64] MI2a: target SELECTED: python3-module-zope.interface 7.2-alt1:sisyphus+363572.100.1.1 at 1732797441
[x86_64] MI2a: requesting to install python3-module-zope.interface (unspec'd ver; inspect with Debug::pkgMark-shallow)
[x86_64] MI2a: marked for install (shallow): python3-module-zope.interface
[x86_64] MI2a: satisfying Depends: python3-module-zc (NULL)
[x86_64] MI2a: maybe install (a direct target): python3-module-zc 1.0.0-alt7:sisyphus+284857.100.1.1 at 1631109117
[x86_64] MI2a: target SELECTED: python3-module-zc 1.0.0-alt7:sisyphus+284857.100.1.1 at 1631109117
[x86_64] MI2a: requesting to install python3-module-zc (unspec'd ver; inspect with Debug::pkgMark-shallow)
[x86_64] MI2a: marked for install (shallow): python3-module-zc
[x86_64] MI2a: satisfying Depends: python3-module-z3c (NULL)
[x86_64] MI2a: maybe install (a direct target): python3-module-z3c 3.0.0-alt4:sisyphus+284857.200.1.1 at 1631109149
[x86_64] MI2a: target SELECTED: python3-module-z3c 3.0.0-alt4:sisyphus+284857.200.1.1 at 1631109149
[x86_64] MI2a: requesting to install python3-module-z3c (unspec'd ver; inspect with Debug::pkgMark-shallow)
[x86_64] MI2a: marked for install (shallow): python3-module-z3c
[x86_64] MI2a: satisfying Depends: python3(paste.deploy) < 0
[x86_64] MI2a: maybe install (a providing target): python3-module-PasteDeploy 1:3.1-alt1:sisyphus+343658.100.1.1 at 1711471990
[x86_64] MI2a: target SELECTED: python3-module-PasteDeploy 1:3.1-alt1:sisyphus+343658.100.1.1 at 1711471990
[x86_64] MI2a: requesting to install python3-module-PasteDeploy (unspec'd ver; inspect with Debug::pkgMark-shallow)
[x86_64] MI2a: marked for install (shallow): python3-module-PasteDeploy
[x86_64] MI2a: satisfying Depends: python3(Paste) < 0
[x86_64] MI2a: maybe install (a providing target): python3-module-paste 3.10.1-alt1:sisyphus+364772.70.5.1 at 1733996555
[x86_64] MI2a: target SELECTED: python3-module-paste 3.10.1-alt1:sisyphus+364772.70.5.1 at 1733996555
[x86_64] MI2a: requesting to install python3-module-paste (unspec'd ver; inspect with Debug::pkgMark-shallow)
[x86_64] MI2a: marked for install (shallow): python3-module-paste
[x86_64] MI2a: satisfying Depends: python3(openid.consumer) < 0
[x86_64] MI2a: maybe install (a providing target): python3-module-openid 3.2.0-alt1:sisyphus+278049.100.2.1 at 1625998936
[x86_64] MI2a: target SELECTED: python3-module-openid 3.2.0-alt1:sisyphus+278049.100.2.1 at 1625998936
[x86_64] MI2a: requesting to install python3-module-openid (unspec'd ver; inspect with Debug::pkgMark-shallow)
[x86_64] MI2a: marked for install (shallow): python3-module-openid
[x86_64] MI2a: satisfying Depends: python3(paste.script.templates) < 0
[x86_64] MI2a: maybe install (a providing target): python3-module-PasteScript 1:3.7.0-alt1:sisyphus+370910.100.1.1 at 1737573838
[x86_64] MI2a: target SELECTED: python3-module-PasteScript 1:3.7.0-alt1:sisyphus+370910.100.1.1 at 1737573838
[x86_64] MI2a: requesting to install python3-module-PasteScript (unspec'd ver; inspect with Debug::pkgMark-shallow)
[x86_64] MI2a: marked for install (shallow): python3-module-PasteScript
[x86_64] MI2a: satisfying Depends: python3(Cheetah) < 0
[x86_64] MI2a: maybe install (a providing target): python3-module-Cheetah 3.4.0-alt1.1:sisyphus+373381.100.1.1 at 1738840655
[x86_64] MI2a: target SELECTED: python3-module-Cheetah 3.4.0-alt1.1:sisyphus+373381.100.1.1 at 1738840655
[x86_64] MI2a: requesting to install python3-module-Cheetah (unspec'd ver; inspect with Debug::pkgMark-shallow)
[x86_64] MI2a: marked for install (shallow): python3-module-Cheetah
[x86_64] MI2a: satisfying Depends: python3(pkg_resources) < 0
[x86_64] MI2a: maybe install (a providing target): python3-module-pkg_resources 1:75.8.0-alt3:sisyphus+377826.100.1.1 at 1741863600
[x86_64] MI2a: target SELECTED: python3-module-pkg_resources 1:75.8.0-alt3:sisyphus+377826.100.1.1 at 1741863600
[x86_64] MI2a: requesting to install python3-module-pkg_resources (unspec'd ver; inspect with Debug::pkgMark-shallow)
[x86_64] MI2a: marked for install (shallow): python3-module-pkg_resources
[x86_64] MI2a: satisfying Depends: python3-module-jaraco-collections (NULL)
[x86_64] MI2a: maybe install (a providing target): python3-module-jaraco.collections 5.1.0-alt1:sisyphus+357809.200.1.1 at 1726769173
[x86_64] MI2a: target SELECTED: python3-module-jaraco.collections 5.1.0-alt1:sisyphus+357809.200.1.1 at 1726769173
[x86_64] MI2a: requesting to install python3-module-jaraco.collections (unspec'd ver; inspect with Debug::pkgMark-shallow)
[x86_64] MI2a: marked for install (shallow): python3-module-jaraco.collections
[x86_64] MI2a: satisfying Depends: python3-module-jaraco-text (NULL)
[x86_64] MI2a: maybe install (a providing target): python3-module-jaraco.text 4.0.0-alt1:sisyphus+353877.400.2.1 at 1722250727
[x86_64] MI2a: target SELECTED: python3-module-jaraco.text 4.0.0-alt1:sisyphus+353877.400.2.1 at 1722250727
[x86_64] MI2a: requesting to install python3-module-jaraco.text (unspec'd ver; inspect with Debug::pkgMark-shallow)
[x86_64] MI2a: marked for install (shallow): python3-module-jaraco.text
[x86_64] MI2a: satisfying Depends: python3-module-autocommand (NULL)
[x86_64] MI2a: maybe install (a direct target): python3-module-autocommand 2.2.2-alt1.1:sisyphus+339714.100.1.1 at 1706968174
[x86_64] MI2a: target SELECTED: python3-module-autocommand 2.2.2-alt1.1:sisyphus+339714.100.1.1 at 1706968174
[x86_64] MI2a: requesting to install python3-module-autocommand (unspec'd ver; inspect with Debug::pkgMark-shallow)
[x86_64] MI2a: marked for install (shallow): python3-module-autocommand
[x86_64] MI2a: satisfying Depends: python3-module-jaraco-context (NULL)
[x86_64] MI2a: maybe install (a providing target): python3-module-jaraco.context 6.0.1-alt1:sisyphus+357809.300.1.1 at 1726769204
[x86_64] MI2a: target SELECTED: python3-module-jaraco.context 6.0.1-alt1:sisyphus+357809.300.1.1 at 1726769204
[x86_64] MI2a: requesting to install python3-module-jaraco.context (unspec'd ver; inspect with Debug::pkgMark-shallow)
[x86_64] MI2a: marked for install (shallow): python3-module-jaraco.context
[x86_64] MI2a: satisfying Depends: python3-module-jaraco-functools (NULL)
[x86_64] MI2a: maybe install (a providing target): python3-module-jaraco.functools 4.1.0-alt1:sisyphus+358564.100.1.1 at 1727528718
[x86_64] MI2a: target SELECTED: python3-module-jaraco.functools 4.1.0-alt1:sisyphus+358564.100.1.1 at 1727528718
[x86_64] MI2a: requesting to install python3-module-jaraco.functools (unspec'd ver; inspect with Debug::pkgMark-shallow)
[x86_64] MI2a: marked for install (shallow): python3-module-jaraco.functools
[x86_64] MI2a: satisfying Depends: python3(more_itertools) < 0
[x86_64] MI2a: maybe install (a providing target): python3-module-more-itertools 10.6.0-alt1:sisyphus+369595.100.2.1 at 1737017267
[x86_64] MI2a: target SELECTED: python3-module-more-itertools 10.6.0-alt1:sisyphus+369595.100.2.1 at 1737017267
[x86_64] MI2a: requesting to install python3-module-more-itertools (unspec'd ver; inspect with Debug::pkgMark-shallow)
[x86_64] MI2a: marked for install (shallow): python3-module-more-itertools
[x86_64] MI2a: satisfying Depends: python3-module-platformdirs (NULL)
[x86_64] MI2a: maybe install (a direct target): python3-module-platformdirs 4.3.7-alt1:sisyphus+378659.100.2.1 at 1742562597
[x86_64] MI2a: target SELECTED: python3-module-platformdirs 4.3.7-alt1:sisyphus+378659.100.2.1 at 1742562597
[x86_64] MI2a: requesting to install python3-module-platformdirs (unspec'd ver; inspect with Debug::pkgMark-shallow)
[x86_64] MI2a: marked for install (shallow): python3-module-platformdirs
[x86_64] MI2a: satisfying Depends: python3-module-wheel (NULL)
[x86_64] MI2a: maybe install (a direct target): python3-module-wheel 0.45.1-alt1:sisyphus+363326.100.2.1 at 1732609968
[x86_64] MI2a: target SELECTED: python3-module-wheel 0.45.1-alt1:sisyphus+363326.100.2.1 at 1732609968
[x86_64] MI2a: requesting to install python3-module-wheel (unspec'd ver; inspect with Debug::pkgMark-shallow)
[x86_64] MI2a: marked for install (shallow): python3-module-wheel
[x86_64] MI2a: satisfying Depends: python3(tornado.httpserver) < 0
[x86_64] MI2a: maybe install (a providing target): python3-module-tornado 6.4.2-alt1:sisyphus+363445.100.1.1 at 1732635491
[x86_64] MI2a: target SELECTED: python3-module-tornado 6.4.2-alt1:sisyphus+363445.100.1.1 at 1732635491
[x86_64] MI2a: requesting to install python3-module-tornado (unspec'd ver; inspect with Debug::pkgMark-shallow)
[x86_64] MI2a: marked for install (shallow): python3-module-tornado
[x86_64] MI2a: satisfying Depends: python3-module-certifi (NULL)
[x86_64] MI2a: maybe install (a direct target): python3-module-certifi 2024.12.14-alt1:sisyphus+369729.200.2.2 at 1737050219
[x86_64] MI2a: target SELECTED: python3-module-certifi 2024.12.14-alt1:sisyphus+369729.200.2.2 at 1737050219
[x86_64] MI2a: requesting to install python3-module-certifi (unspec'd ver; inspect with Debug::pkgMark-shallow)
[x86_64] MI2a: marked for install (shallow): python3-module-certifi
[x86_64] MI2a: satisfying Depends: python3(pycares) < 0
[x86_64] MI2a: maybe install (a providing target): python3-module-pycares 4.5.0-alt1:sisyphus+372989.100.1.1 at 1738501857
[x86_64] MI2a: target SELECTED: python3-module-pycares 4.5.0-alt1:sisyphus+372989.100.1.1 at 1738501857
[x86_64] MI2a: requesting to install python3-module-pycares (unspec'd ver; inspect with Debug::pkgMark-shallow)
[x86_64] MI2a: marked for install (shallow): python3-module-pycares
[x86_64] MI2a: satisfying Depends: python3(twisted.internet.abstract) < 0
[x86_64] MI2a: maybe install (a providing target): python3-module-twisted-core 24.11.0-alt2:sisyphus+376609.40.2.1 at 1740866761
[x86_64] MI2a: target SELECTED: python3-module-twisted-core 24.11.0-alt2:sisyphus+376609.40.2.1 at 1740866761
[x86_64] MI2a: requesting to install python3-module-twisted-core (unspec'd ver; inspect with Debug::pkgMark-shallow)
[x86_64] MI2a: marked for install (shallow): python3-module-twisted-core
[x86_64] MI2a: satisfying Depends: python3(appdirs) < 0
[x86_64] MI2a: maybe install (a providing target): python3-module-appdirs 1.4.4-alt2:sisyphus+359005.100.1.1 at 1728036426
[x86_64] MI2a: target SELECTED: python3-module-appdirs 1.4.4-alt2:sisyphus+359005.100.1.1 at 1728036426
[x86_64] MI2a: requesting to install python3-module-appdirs (unspec'd ver; inspect with Debug::pkgMark-shallow)
[x86_64] MI2a: marked for install (shallow): python3-module-appdirs
[x86_64] MI2a: satisfying Depends: python3(automat) < 0
[x86_64] MI2a: maybe install (a providing target): python3-module-automat 24.8.1-alt1:sisyphus+355768.100.2.1 at 1724411664
[x86_64] MI2a: target SELECTED: python3-module-automat 24.8.1-alt1:sisyphus+355768.100.2.1 at 1724411664
[x86_64] MI2a: requesting to install python3-module-automat (unspec'd ver; inspect with Debug::pkgMark-shallow)
[x86_64] MI2a: marked for install (shallow): python3-module-automat
[x86_64] MI2a: satisfying Depends: python3(hyperlink) < 0
[x86_64] MI2a: maybe install (a providing target): python3-module-hyperlink 21.0.0-alt1.1:sisyphus+304836.100.1.1 at 1659710964
[x86_64] MI2a: target SELECTED: python3-module-hyperlink 21.0.0-alt1.1:sisyphus+304836.100.1.1 at 1659710964
[x86_64] MI2a: requesting to install python3-module-hyperlink (unspec'd ver; inspect with Debug::pkgMark-shallow)
[x86_64] MI2a: marked for install (shallow): python3-module-hyperlink
[x86_64] MI2a: satisfying Depends: python3(serial) < 0
[x86_64] MI2a: maybe install (a providing target): python3-module-serial 3.5-alt3:sisyphus+360600.100.2.1 at 1729786231
[x86_64] MI2a: target SELECTED: python3-module-serial 3.5-alt3:sisyphus+360600.100.2.1 at 1729786231
[x86_64] MI2a: requesting to install python3-module-serial (unspec'd ver; inspect with Debug::pkgMark-shallow)
[x86_64] MI2a: marked for install (shallow): python3-module-serial
[x86_64] MI2a: satisfying Depends: python3(hid) < 0
[x86_64] MI2a: maybe install (a providing target): python3-module-cython-hidapi 0.14.0-alt1.1:sisyphus+333513.54340.73.1 at 1704651867
[x86_64] MI2a: target SELECTED: python3-module-cython-hidapi 0.14.0-alt1.1:sisyphus+333513.54340.73.1 at 1704651867
[x86_64] MI2a: requesting to install python3-module-cython-hidapi (unspec'd ver; inspect with Debug::pkgMark-shallow)
[x86_64] MI2a: marked for install (shallow): python3-module-cython-hidapi
[x86_64] MI2a: satisfying Depends: libhidapi-hidraw.so.0()(64bit) >= set:idVzQSm8qwHaDxTkTjc0uUa9b4LCTWaiqTzomaKPl5
[x86_64] MI2a: maybe install (a providing target): libhidapi 0.14.0-alt1:sisyphus+378183.100.1.1 at 1742067545
[x86_64] MI2a: target SELECTED: libhidapi 0.14.0-alt1:sisyphus+378183.100.1.1 at 1742067545
[x86_64] MI2a: requesting to install libhidapi (unspec'd ver; inspect with Debug::pkgMark-shallow)
[x86_64] MI2a: marked for install (shallow): libhidapi
[x86_64] MI2a: satisfying Depends: libusb-1.0.so.0()(64bit) >= set:kfVTRgUEIUmjFX2IAipIvyS7RTRZqexJaD3JlmiYanqVHFDk94KrEEGfYdbQ1ana
[x86_64] MI2a: maybe install (a providing target): libusb 1.0.27-alt1:sisyphus+347412.100.1.1 at 1714739651
[x86_64] MI2a: target SELECTED: libusb 1.0.27-alt1:sisyphus+347412.100.1.1 at 1714739651
[x86_64] MI2a: requesting to install libusb (unspec'd ver; inspect with Debug::pkgMark-shallow)
[x86_64] MI2a: marked for install (shallow): libusb
[x86_64] MI2a: satisfying Depends: python3-module-twisted-logger = 24.11.0-alt2:sisyphus+376609.40.2.1
[x86_64] MI2a: maybe install (a direct target): python3-module-twisted-logger 24.11.0-alt2:sisyphus+376609.40.2.1 at 1740866761
[x86_64] MI2a: target SELECTED: python3-module-twisted-logger 24.11.0-alt2:sisyphus+376609.40.2.1 at 1740866761
[x86_64] MI2a: requesting to install python3-module-twisted-logger (unspec'd ver; inspect with Debug::pkgMark-shallow)
[x86_64] MI2a: marked for install (shallow): python3-module-twisted-logger
[x86_64] MI2a: satisfying Depends: python3(constantly) < 0
[x86_64] MI2a: maybe install (a providing target): python3-module-constantly 15.1.0-alt7:sisyphus+338906.100.1.1 at 1706107088
[x86_64] MI2a: target SELECTED: python3-module-constantly 15.1.0-alt7:sisyphus+338906.100.1.1 at 1706107088
[x86_64] MI2a: requesting to install python3-module-constantly (unspec'd ver; inspect with Debug::pkgMark-shallow)
[x86_64] MI2a: marked for install (shallow): python3-module-constantly
[x86_64] MI2a: satisfying Depends: python3(incremental) < 0
[x86_64] MI2a: maybe install (a providing target): python3-module-incremental 22.10.0-alt1:sisyphus+312706.100.1.1 at 1672404273
[x86_64] MI2a: target SELECTED: python3-module-incremental 22.10.0-alt1:sisyphus+312706.100.1.1 at 1672404273
[x86_64] MI2a: requesting to install python3-module-incremental (unspec'd ver; inspect with Debug::pkgMark-shallow)
[x86_64] MI2a: marked for install (shallow): python3-module-incremental
[x86_64] MI2a: satisfying Depends: python3(click) < 0
[x86_64] MI2a: maybe install (a providing target): python3-module-click 8.1.8-alt1:sisyphus+366297.100.1.1 at 1734946237
[x86_64] MI2a: target SELECTED: python3-module-click 8.1.8-alt1:sisyphus+366297.100.1.1 at 1734946237
[x86_64] MI2a: requesting to install python3-module-click (unspec'd ver; inspect with Debug::pkgMark-shallow)
[x86_64] MI2a: marked for install (shallow): python3-module-click
[x86_64] MI2a: satisfying Depends: python3-module-twisted-web = 24.11.0-alt2:sisyphus+376609.40.2.1
[x86_64] MI2a: maybe install (a direct target): python3-module-twisted-web 24.11.0-alt2:sisyphus+376609.40.2.1 at 1740866761
[x86_64] MI2a: target SELECTED: python3-module-twisted-web 24.11.0-alt2:sisyphus+376609.40.2.1 at 1740866761
[x86_64] MI2a: requesting to install python3-module-twisted-web (unspec'd ver; inspect with Debug::pkgMark-shallow)
[x86_64] MI2a: marked for install (shallow): python3-module-twisted-web
[x86_64] MI2a: satisfying Depends: python3(h2.config) < 0
[x86_64] MI2a: maybe install (a providing target): python3-module-h2 4.1.0-alt1:sisyphus+325714.100.2.2 at 1690478873
[x86_64] MI2a: target SELECTED: python3-module-h2 4.1.0-alt1:sisyphus+325714.100.2.2 at 1690478873
[x86_64] MI2a: requesting to install python3-module-h2 (unspec'd ver; inspect with Debug::pkgMark-shallow)
[x86_64] MI2a: marked for install (shallow): python3-module-h2
[x86_64] MI2a: satisfying Depends: python3-module-hyperframe < 7
[x86_64] MI2a: maybe install (a direct target): python3-module-hyperframe 6.0.1-alt1:sisyphus+270376.300.2.1 at 1618957001
[x86_64] MI2a: target SELECTED: python3-module-hyperframe 6.0.1-alt1:sisyphus+270376.300.2.1 at 1618957001
[x86_64] MI2a: requesting to install python3-module-hyperframe (unspec'd ver; inspect with Debug::pkgMark-shallow)
[x86_64] MI2a: marked for install (shallow): python3-module-hyperframe
[x86_64] MI2a: satisfying Depends: python3-module-hpack < 5
[x86_64] MI2a: maybe install (a direct target): python3-module-hpack 4.0.0-alt1:sisyphus+270376.200.1.1 at 1618956626
[x86_64] MI2a: target SELECTED: python3-module-hpack 4.0.0-alt1:sisyphus+270376.200.1.1 at 1618956626
[x86_64] MI2a: requesting to install python3-module-hpack (unspec'd ver; inspect with Debug::pkgMark-shallow)
[x86_64] MI2a: marked for install (shallow): python3-module-hpack
[x86_64] MI2a: satisfying Depends: python3(priority) < 0
[x86_64] MI2a: maybe install (a providing target): python3-module-priority 2.0.0-alt3:sisyphus+338701.100.1.2 at 1705988383
[x86_64] MI2a: target SELECTED: python3-module-priority 2.0.0-alt3:sisyphus+338701.100.1.2 at 1705988383
[x86_64] MI2a: requesting to install python3-module-priority (unspec'd ver; inspect with Debug::pkgMark-shallow)
[x86_64] MI2a: marked for install (shallow): python3-module-priority
[x86_64] MI2a: satisfying Depends: python3(typing_extensions) < 0
[x86_64] MI2a: maybe install (a providing target): python3-module-typing_extensions 4.13.0-alt1:sisyphus+379896.100.1.1 at 1743509204
[x86_64] MI2a: target SELECTED: python3-module-typing_extensions 4.13.0-alt1:sisyphus+379896.100.1.1 at 1743509204
[x86_64] MI2a: requesting to install python3-module-typing_extensions (unspec'd ver; inspect with Debug::pkgMark-shallow)
[x86_64] MI2a: marked for install (shallow): python3-module-typing_extensions
[x86_64] MI2a: satisfying Depends: python3-module-twisted-words = 24.11.0-alt2:sisyphus+376609.40.2.1
[x86_64] MI2a: maybe install (a direct target): python3-module-twisted-words 24.11.0-alt2:sisyphus+376609.40.2.1 at 1740866761
[x86_64] MI2a: target SELECTED: python3-module-twisted-words 24.11.0-alt2:sisyphus+376609.40.2.1 at 1740866761
[x86_64] MI2a: requesting to install python3-module-twisted-words (unspec'd ver; inspect with Debug::pkgMark-shallow)
[x86_64] MI2a: marked for install (shallow): python3-module-twisted-words
[x86_64] MI2a: satisfying Depends: python3(twisted.names.cache) < 0
[x86_64] MI2a: maybe install (a providing target): python3-module-twisted-names 24.11.0-alt2:sisyphus+376609.40.2.1 at 1740866761
[x86_64] MI2a: target SELECTED: python3-module-twisted-names 24.11.0-alt2:sisyphus+376609.40.2.1 at 1740866761
[x86_64] MI2a: requesting to install python3-module-twisted-names (unspec'd ver; inspect with Debug::pkgMark-shallow)
[x86_64] MI2a: marked for install (shallow): python3-module-twisted-names
[x86_64] MI2a: satisfying Depends: python3(multidict) < 0
[x86_64] MI2a: maybe install (a providing target): python3-module-multidict 6.3.0-alt1:sisyphus+379928.100.1.1 at 1743519212
[x86_64] MI2a: target SELECTED: python3-module-multidict 6.3.0-alt1:sisyphus+379928.100.1.1 at 1743519212
[x86_64] MI2a: requesting to install python3-module-multidict (unspec'd ver; inspect with Debug::pkgMark-shallow)
[x86_64] MI2a: marked for install (shallow): python3-module-multidict
[x86_64] MI2a: satisfying Depends: python3(propcache.api) < 0
[x86_64] MI2a: maybe install (a providing target): python3-module-propcache 0.2.1-alt1:sisyphus+369528.100.1.1 at 1736868993
[x86_64] MI2a: target SELECTED: python3-module-propcache 0.2.1-alt1:sisyphus+369528.100.1.1 at 1736868993
[x86_64] MI2a: requesting to install python3-module-propcache (unspec'd ver; inspect with Debug::pkgMark-shallow)
[x86_64] MI2a: marked for install (shallow): python3-module-propcache
[x86_64] MI2a: satisfying Depends: python3(yarl) < 0
[x86_64] MI2a: maybe install (a providing target): python3-module-yarl 1.18.3-alt1:sisyphus+369529.100.2.1 at 1736876451
[x86_64] MI2a: target SELECTED: python3-module-yarl 1.18.3-alt1:sisyphus+369529.100.2.1 at 1736876451
[x86_64] MI2a: requesting to install python3-module-yarl (unspec'd ver; inspect with Debug::pkgMark-shallow)
[x86_64] MI2a: marked for install (shallow): python3-module-yarl
[x86_64] MI2a: satisfying Depends: python3(aiohttp_asgi) < 0
[x86_64] MI2a: maybe install (a providing target): python3-module-aiohttp-asgi 0.5.2-alt2:sisyphus+380033.100.1.1 at 1743605945
[x86_64] MI2a: target SELECTED: python3-module-aiohttp-asgi 0.5.2-alt2:sisyphus+380033.100.1.1 at 1743605945
[x86_64] MI2a: requesting to install python3-module-aiohttp-asgi (unspec'd ver; inspect with Debug::pkgMark-shallow)
[x86_64] MI2a: marked for install (shallow): python3-module-aiohttp-asgi
[x86_64] MI2a: satisfying Depends: python3(asgiref.typing) < 0
[x86_64] MI2a: maybe install (a providing target): python3-module-asgiref 3.8.1-alt1:sisyphus+372174.1500.2.1 at 1738333633
[x86_64] MI2a: target SELECTED: python3-module-asgiref 3.8.1-alt1:sisyphus+372174.1500.2.1 at 1738333633
[x86_64] MI2a: requesting to install python3-module-asgiref (unspec'd ver; inspect with Debug::pkgMark-shallow)
[x86_64] MI2a: marked for install (shallow): python3-module-asgiref
[x86_64] MI2a: satisfying Depends: python3(croniter) < 0
[x86_64] MI2a: maybe install (a providing target): python3-module-croniter 6.0.0-alt1:sisyphus+365336.100.1.1 at 1734511703
[x86_64] MI2a: target SELECTED: python3-module-croniter 6.0.0-alt1:sisyphus+365336.100.1.1 at 1734511703
[x86_64] MI2a: requesting to install python3-module-croniter (unspec'd ver; inspect with Debug::pkgMark-shallow)
[x86_64] MI2a: marked for install (shallow): python3-module-croniter
[x86_64] MI2a: satisfying Depends: python3-module-python-dateutil (NULL)
[x86_64] MI2a: maybe install (a providing target): python3-module-dateutil 2.9.0.post0-alt1:sisyphus+378451.100.1.1 at 1742313746
[x86_64] MI2a: target SELECTED: python3-module-dateutil 2.9.0.post0-alt1:sisyphus+378451.100.1.1 at 1742313746
[x86_64] MI2a: requesting to install python3-module-dateutil (unspec'd ver; inspect with Debug::pkgMark-shallow)
[x86_64] MI2a: marked for install (shallow): python3-module-dateutil
[x86_64] MI2a: satisfying Depends: python3(six) < 0
[x86_64] MI2a: maybe install (a providing target): python3-module-six 1.17.0-alt1.1:sisyphus+373470.100.1.1 at 1738920023
[x86_64] MI2a: target SELECTED: python3-module-six 1.17.0-alt1.1:sisyphus+373470.100.1.1 at 1738920023
[x86_64] MI2a: requesting to install python3-module-six (unspec'd ver; inspect with Debug::pkgMark-shallow)
[x86_64] MI2a: marked for install (shallow): python3-module-six
[x86_64] MI2a: satisfying Depends: python3-module-pytz (NULL)
[x86_64] MI2a: maybe install (a direct target): python3-module-pytz 1:2025.2-alt1:sisyphus+379213.100.2.1 at 1742985453
[x86_64] MI2a: target SELECTED: python3-module-pytz 1:2025.2-alt1:sisyphus+379213.100.2.1 at 1742985453
[x86_64] MI2a: requesting to install python3-module-pytz (unspec'd ver; inspect with Debug::pkgMark-shallow)
[x86_64] MI2a: marked for install (shallow): python3-module-pytz
[x86_64] MI2a: satisfying Depends: python3(dnslib) < 0
[x86_64] MI2a: maybe install (a providing target): python3-module-dnslib 0.9.7-alt3:sisyphus+241021.100.1.1 at 1574174669
[x86_64] MI2a: target SELECTED: python3-module-dnslib 0.9.7-alt3:sisyphus+241021.100.1.1 at 1574174669
[x86_64] MI2a: requesting to install python3-module-dnslib (unspec'd ver; inspect with Debug::pkgMark-shallow)
[x86_64] MI2a: marked for install (shallow): python3-module-dnslib
[x86_64] MI2a: satisfying Depends: python3(raven) < 0
[x86_64] MI2a: maybe install (a providing target): python3-module-raven 6.10.0-alt2:sisyphus+280727.100.1.1 at 1627279692
[x86_64] MI2a: target SELECTED: python3-module-raven 6.10.0-alt2:sisyphus+280727.100.1.1 at 1627279692
[x86_64] MI2a: requesting to install python3-module-raven (unspec'd ver; inspect with Debug::pkgMark-shallow)
[x86_64] MI2a: marked for install (shallow): python3-module-raven
[x86_64] MI2a: satisfying Depends: python3(ZConfig.components.logger.factory) < 0
[x86_64] MI2a: maybe install (a providing target): python3-module-zconfig 4.2-alt1:sisyphus+369722.100.1.2 at 1737043907
[x86_64] MI2a: target SELECTED: python3-module-zconfig 4.2-alt1:sisyphus+369722.100.1.2 at 1737043907
[x86_64] MI2a: requesting to install python3-module-zconfig (unspec'd ver; inspect with Debug::pkgMark-shallow)
[x86_64] MI2a: marked for install (shallow): python3-module-zconfig
[x86_64] MI2a: satisfying Depends: python3(pygments.lexer) < 0
[x86_64] MI2a: maybe install (a providing target): python3-module-Pygments 2.19.1-alt1:sisyphus+368586.100.2.1 at 1737039695
[x86_64] MI2a: target SELECTED: python3-module-Pygments 2.19.1-alt1:sisyphus+368586.100.2.1 at 1737039695
[x86_64] MI2a: requesting to install python3-module-Pygments (unspec'd ver; inspect with Debug::pkgMark-shallow)
[x86_64] MI2a: marked for install (shallow): python3-module-Pygments
[x86_64] MI2a: satisfying Depends: python3(blinker) < 0
[x86_64] MI2a: maybe install (a providing target): python3-module-blinker 1.9.0-alt1:sisyphus+362571.300.7.1 at 1734000808
[x86_64] MI2a: target SELECTED: python3-module-blinker 1.9.0-alt1:sisyphus+362571.300.7.1 at 1734000808
[x86_64] MI2a: requesting to install python3-module-blinker (unspec'd ver; inspect with Debug::pkgMark-shallow)
[x86_64] MI2a: marked for install (shallow): python3-module-blinker
[x86_64] MI2a: satisfying Depends: python3(celery.exceptions) < 0
[x86_64] MI2a: maybe install (a providing target): python3-module-celery 5.3.6-alt2:sisyphus+365444.100.1.1 at 1734621417
[x86_64] MI2a: target SELECTED: python3-module-celery 5.3.6-alt2:sisyphus+365444.100.1.1 at 1734621417
[x86_64] MI2a: requesting to install python3-module-celery (unspec'd ver; inspect with Debug::pkgMark-shallow)
[x86_64] MI2a: marked for install (shallow): python3-module-celery
[x86_64] MI2a: satisfying Depends: python3-module-kombu >= 4.6.10
[x86_64] MI2a: maybe install (a direct target): python3-module-kombu 1:5.3.5-alt2:sisyphus+340948.100.1.1 at 1708266319
[x86_64] MI2a: target SELECTED: python3-module-kombu 1:5.3.5-alt2:sisyphus+340948.100.1.1 at 1708266319
[x86_64] MI2a: requesting to install python3-module-kombu (unspec'd ver; inspect with Debug::pkgMark-shallow)
[x86_64] MI2a: marked for install (shallow): python3-module-kombu
[x86_64] MI2a: satisfying Depends: python3(amqp) < 0
[x86_64] MI2a: maybe install (a providing target): python3-module-amqp 1:5.3.1-alt1:sisyphus+362428.100.1.1 at 1731490592
[x86_64] MI2a: target SELECTED: python3-module-amqp 1:5.3.1-alt1:sisyphus+362428.100.1.1 at 1731490592
[x86_64] MI2a: requesting to install python3-module-amqp (unspec'd ver; inspect with Debug::pkgMark-shallow)
[x86_64] MI2a: marked for install (shallow): python3-module-amqp
[x86_64] MI2a: satisfying Depends: python3-module-vine (NULL)
[x86_64] MI2a: maybe install (a direct target): python3-module-vine 5.1.0-alt1:sisyphus+341591.100.2.2 at 1709198592
[x86_64] MI2a: target SELECTED: python3-module-vine 5.1.0-alt1:sisyphus+341591.100.2.2 at 1709198592
[x86_64] MI2a: requesting to install python3-module-vine (unspec'd ver; inspect with Debug::pkgMark-shallow)
[x86_64] MI2a: marked for install (shallow): python3-module-vine
[x86_64] MI2a: satisfying Depends: python3(botocore.client) < 0
[x86_64] MI2a: maybe install (a providing target): python3-module-botocore 1.37.13-alt1:sisyphus+378421.100.2.1 at 1742313489
[x86_64] MI2a: target SELECTED: python3-module-botocore 1.37.13-alt1:sisyphus+378421.100.2.1 at 1742313489
[x86_64] MI2a: requesting to install python3-module-botocore (unspec'd ver; inspect with Debug::pkgMark-shallow)
[x86_64] MI2a: marked for install (shallow): python3-module-botocore
[x86_64] MI2a: satisfying Depends: python3-module-jmespath (NULL)
[x86_64] MI2a: maybe install (a direct target): python3-module-jmespath 1.0.1-alt1:sisyphus+317988.100.2.1 at 1680612150
[x86_64] MI2a: target SELECTED: python3-module-jmespath 1.0.1-alt1:sisyphus+317988.100.2.1 at 1680612150
[x86_64] MI2a: requesting to install python3-module-jmespath (unspec'd ver; inspect with Debug::pkgMark-shallow)
[x86_64] MI2a: marked for install (shallow): python3-module-jmespath
[x86_64] MI2a: satisfying Depends: python3-module-urllib3 (NULL)
[x86_64] MI2a: maybe install (a direct target): python3-module-urllib3 2:2.3.0-alt1:sisyphus+366320.100.2.1 at 1735116352
[x86_64] MI2a: target SELECTED: python3-module-urllib3 2:2.3.0-alt1:sisyphus+366320.100.2.1 at 1735116352
[x86_64] MI2a: requesting to install python3-module-urllib3 (unspec'd ver; inspect with Debug::pkgMark-shallow)
[x86_64] MI2a: marked for install (shallow): python3-module-urllib3
[x86_64] MI2a: satisfying Depends: python3-module-requests (NULL)
[x86_64] MI2a: maybe install (a direct target): python3-module-requests 2.32.3-alt1:sisyphus+349946.100.1.1 at 1717059877
[x86_64] MI2a: target SELECTED: python3-module-requests 2.32.3-alt1:sisyphus+349946.100.1.1 at 1717059877
[x86_64] MI2a: requesting to install python3-module-requests (unspec'd ver; inspect with Debug::pkgMark-shallow)
[x86_64] MI2a: marked for install (shallow): python3-module-requests
[x86_64] MI2a: satisfying Depends: python3-module-charset-normalizer (NULL)
[x86_64] MI2a: maybe install (a direct target): python3-module-charset-normalizer 3.2.0-alt1:sisyphus+347396.200.2.1 at 1714733155
[x86_64] MI2a: target SELECTED: python3-module-charset-normalizer 3.2.0-alt1:sisyphus+347396.200.2.1 at 1714733155
[x86_64] MI2a: requesting to install python3-module-charset-normalizer (unspec'd ver; inspect with Debug::pkgMark-shallow)
[x86_64] MI2a: marked for install (shallow): python3-module-charset-normalizer
[x86_64] MI2a: satisfying Depends: python3(docutils) < 0
[x86_64] MI2a: maybe install (a providing target): python3-module-docutils 0.20.1-alt1:sisyphus+323438.100.1.1 at 1687370718
[x86_64] MI2a: target SELECTED: python3-module-docutils 0.20.1-alt1:sisyphus+323438.100.1.1 at 1687370718
[x86_64] MI2a: requesting to install python3-module-docutils (unspec'd ver; inspect with Debug::pkgMark-shallow)
[x86_64] MI2a: marked for install (shallow): python3-module-docutils
[x86_64] MI2a: satisfying Depends: python3(sphinx.locale) < 0
[x86_64] MI2a: maybe install (a providing target): python3-module-sphinx 1:8.2.1-alt1:sisyphus+376300.100.1.1 at 1740663832
[x86_64] MI2a: target SELECTED: python3-module-sphinx 1:8.2.1-alt1:sisyphus+376300.100.1.1 at 1740663832
[x86_64] MI2a: requesting to install python3-module-sphinx (unspec'd ver; inspect with Debug::pkgMark-shallow)
[x86_64] MI2a: marked for install (shallow): python3-module-sphinx
[x86_64] MI2a: satisfying Depends: python3(sphinxcontrib.applehelp) (NULL)
[x86_64] MI2a: maybe install (a providing target): python3-module-sphinxcontrib-applehelp 2.0.0-alt1:sisyphus+353872.100.1.1 at 1722243556
[x86_64] MI2a: target SELECTED: python3-module-sphinxcontrib-applehelp 2.0.0-alt1:sisyphus+353872.100.1.1 at 1722243556
[x86_64] MI2a: requesting to install python3-module-sphinxcontrib-applehelp (unspec'd ver; inspect with Debug::pkgMark-shallow)
[x86_64] MI2a: marked for install (shallow): python3-module-sphinxcontrib-applehelp
[x86_64] MI2a: satisfying Depends: python3(sphinxcontrib.devhelp) (NULL)
[x86_64] MI2a: maybe install (a providing target): python3-module-sphinxcontrib-devhelp 2.0.0-alt1:sisyphus+353872.200.1.1 at 1722243589
[x86_64] MI2a: target SELECTED: python3-module-sphinxcontrib-devhelp 2.0.0-alt1:sisyphus+353872.200.1.1 at 1722243589
[x86_64] MI2a: requesting to install python3-module-sphinxcontrib-devhelp (unspec'd ver; inspect with Debug::pkgMark-shallow)
[x86_64] MI2a: marked for install (shallow): python3-module-sphinxcontrib-devhelp
[x86_64] MI2a: satisfying Depends: python3(sphinxcontrib.jquery) (NULL)
[x86_64] MI2a: maybe install (a providing target): python3-module-sphinxcontrib-jquery 4.1-alt3:sisyphus+339023.100.1.1 at 1706234262
[x86_64] MI2a: target SELECTED: python3-module-sphinxcontrib-jquery 4.1-alt3:sisyphus+339023.100.1.1 at 1706234262
[x86_64] MI2a: requesting to install python3-module-sphinxcontrib-jquery (unspec'd ver; inspect with Debug::pkgMark-shallow)
[x86_64] MI2a: marked for install (shallow): python3-module-sphinxcontrib-jquery
[x86_64] MI2a: satisfying Depends: python3(sphinxcontrib.jsmath) (NULL)
[x86_64] MI2a: maybe install (a providing target): python3-module-sphinxcontrib-jsmath 1.0.1-alt2:sisyphus+348403.100.1.1 at 1716017686
[x86_64] MI2a: target SELECTED: python3-module-sphinxcontrib-jsmath 1.0.1-alt2:sisyphus+348403.100.1.1 at 1716017686
[x86_64] MI2a: requesting to install python3-module-sphinxcontrib-jsmath (unspec'd ver; inspect with Debug::pkgMark-shallow)
[x86_64] MI2a: marked for install (shallow): python3-module-sphinxcontrib-jsmath
[x86_64] MI2a: satisfying Depends: python3(sphinxcontrib.htmlhelp) (NULL)
[x86_64] MI2a: maybe install (a providing target): python3-module-sphinxcontrib-htmlhelp 2.1.0-alt1:sisyphus+353893.100.2.1 at 1722416845
[x86_64] MI2a: target SELECTED: python3-module-sphinxcontrib-htmlhelp 2.1.0-alt1:sisyphus+353893.100.2.1 at 1722416845
[x86_64] MI2a: requesting to install python3-module-sphinxcontrib-htmlhelp (unspec'd ver; inspect with Debug::pkgMark-shallow)
[x86_64] MI2a: marked for install (shallow): python3-module-sphinxcontrib-htmlhelp
[x86_64] MI2a: satisfying Depends: python3(sphinxcontrib.serializinghtml) (NULL)
[x86_64] MI2a: maybe install (a providing target): python3-module-sphinxcontrib-serializinghtml 2.0.0-alt1:sisyphus+361088.100.1.1 at 1730215552
[x86_64] MI2a: target SELECTED: python3-module-sphinxcontrib-serializinghtml 2.0.0-alt1:sisyphus+361088.100.1.1 at 1730215552
[x86_64] MI2a: requesting to install python3-module-sphinxcontrib-serializinghtml (unspec'd ver; inspect with Debug::pkgMark-shallow)
[x86_64] MI2a: marked for install (shallow): python3-module-sphinxcontrib-serializinghtml
[x86_64] MI2a: satisfying Depends: python3(sphinxcontrib.qthelp) (NULL)
[x86_64] MI2a: maybe install (a providing target): python3-module-sphinxcontrib-qthelp 2.0.0-alt1:sisyphus+353872.300.1.1 at 1722243619
[x86_64] MI2a: target SELECTED: python3-module-sphinxcontrib-qthelp 2.0.0-alt1:sisyphus+353872.300.1.1 at 1722243619
[x86_64] MI2a: requesting to install python3-module-sphinxcontrib-qthelp (unspec'd ver; inspect with Debug::pkgMark-shallow)
[x86_64] MI2a: marked for install (shallow): python3-module-sphinxcontrib-qthelp
[x86_64] MI2a: satisfying Depends: python3(babel) (NULL)
[x86_64] MI2a: maybe install (a providing target): python3-module-babel 1:2.15.0-alt1:sisyphus+353791.100.1.1 at 1722073848
[x86_64] MI2a: target SELECTED: python3-module-babel 1:2.15.0-alt1:sisyphus+353791.100.1.1 at 1722073848
[x86_64] MI2a: requesting to install python3-module-babel (unspec'd ver; inspect with Debug::pkgMark-shallow)
[x86_64] MI2a: marked for install (shallow): python3-module-babel
[x86_64] MI2a: satisfying Depends: python3(alabaster) (NULL)
[x86_64] MI2a: maybe install (a providing target): python3-module-alabaster 0.7.16-alt1:sisyphus+349698.100.1.1 at 1716897815
[x86_64] MI2a: target SELECTED: python3-module-alabaster 0.7.16-alt1:sisyphus+349698.100.1.1 at 1716897815
[x86_64] MI2a: requesting to install python3-module-alabaster (unspec'd ver; inspect with Debug::pkgMark-shallow)
[x86_64] MI2a: marked for install (shallow): python3-module-alabaster
[x86_64] MI2a: satisfying Depends: python3(defusedxml) (NULL)
[x86_64] MI2a: maybe install (a providing target): python3-module-defusedxml 0.7.1-alt1:sisyphus+274841.2300.1.1 at 1624295691
[x86_64] MI2a: target SELECTED: python3-module-defusedxml 0.7.1-alt1:sisyphus+274841.2300.1.1 at 1624295691
[x86_64] MI2a: requesting to install python3-module-defusedxml (unspec'd ver; inspect with Debug::pkgMark-shallow)
[x86_64] MI2a: marked for install (shallow): python3-module-defusedxml
[x86_64] MI2a: satisfying Depends: /usr/share/python-sphinx/objects.inv (NULL)
[x86_64] MI2a: maybe install (a providing target): python-sphinx-objects.inv 1:2.3.14.20250314-alt1:sisyphus+377959.100.1.1 at 1741992107
[x86_64] MI2a: target SELECTED: python-sphinx-objects.inv 1:2.3.14.20250314-alt1:sisyphus+377959.100.1.1 at 1741992107
[x86_64] MI2a: requesting to install python-sphinx-objects.inv (unspec'd ver; inspect with Debug::pkgMark-shallow)
[x86_64] MI2a: marked for install (shallow): python-sphinx-objects.inv
[x86_64] MI2a: satisfying Depends: python3(imagesize) < 0
[x86_64] MI2a: maybe install (a providing target): python3-module-imagesize 1.4.1-alt1:sisyphus+318084.100.1.1 at 1680697673
[x86_64] MI2a: target SELECTED: python3-module-imagesize 1.4.1-alt1:sisyphus+318084.100.1.1 at 1680697673
[x86_64] MI2a: requesting to install python3-module-imagesize (unspec'd ver; inspect with Debug::pkgMark-shallow)
[x86_64] MI2a: marked for install (shallow): python3-module-imagesize
[x86_64] MI2a: satisfying Depends: python3(jinja2) < 0
[x86_64] MI2a: maybe install (a providing target): python3-module-jinja2 3.1.6-alt1:sisyphus+377889.1500.2.1 at 1742249941
[x86_64] MI2a: target SELECTED: python3-module-jinja2 3.1.6-alt1:sisyphus+377889.1500.2.1 at 1742249941
[x86_64] MI2a: requesting to install python3-module-jinja2 (unspec'd ver; inspect with Debug::pkgMark-shallow)
[x86_64] MI2a: marked for install (shallow): python3-module-jinja2
[x86_64] MI2a: satisfying Depends: python3(markupsafe) < 0
[x86_64] MI2a: maybe install (a providing target): python3-module-markupsafe 1:3.0.2-alt1:sisyphus+360209.100.1.1 at 1729323052
[x86_64] MI2a: target SELECTED: python3-module-markupsafe 1:3.0.2-alt1:sisyphus+360209.100.1.1 at 1729323052
[x86_64] MI2a: requesting to install python3-module-markupsafe (unspec'd ver; inspect with Debug::pkgMark-shallow)
[x86_64] MI2a: marked for install (shallow): python3-module-markupsafe
[x86_64] MI2a: satisfying Depends: python3(roman_numerals) < 0
[x86_64] MI2a: maybe install (a providing target): python3-module-roman_numerals 3.1.0-alt1:sisyphus+376287.100.1.1 at 1740659993
[x86_64] MI2a: target SELECTED: python3-module-roman_numerals 3.1.0-alt1:sisyphus+376287.100.1.1 at 1740659993
[x86_64] MI2a: requesting to install python3-module-roman_numerals (unspec'd ver; inspect with Debug::pkgMark-shallow)
[x86_64] MI2a: marked for install (shallow): python3-module-roman_numerals
[x86_64] MI2a: satisfying Depends: python3(snowballstemmer) < 0
[x86_64] MI2a: maybe install (a providing target): python3-module-snowballstemmer 2.2.0-alt1:sisyphus+319215.100.1.1 at 1682346633
[x86_64] MI2a: target SELECTED: python3-module-snowballstemmer 2.2.0-alt1:sisyphus+319215.100.1.1 at 1682346633
[x86_64] MI2a: requesting to install python3-module-snowballstemmer (unspec'd ver; inspect with Debug::pkgMark-shallow)
[x86_64] MI2a: marked for install (shallow): python3-module-snowballstemmer
[x86_64] MI2a: satisfying Depends: python3-module-sphinx-sphinx-build-symlink = 1:8.2.1-alt1:sisyphus+376300.100.1.1
[x86_64] MI2a: maybe install (a direct target): python3-module-sphinx-sphinx-build-symlink 1:8.2.1-alt1:sisyphus+376300.100.1.1 at 1740663832
[x86_64] MI2a: target SELECTED: python3-module-sphinx-sphinx-build-symlink 1:8.2.1-alt1:sisyphus+376300.100.1.1 at 1740663832
[x86_64] MI2a: requesting to install python3-module-sphinx-sphinx-build-symlink (unspec'd ver; inspect with Debug::pkgMark-shallow)
[x86_64] MI2a: marked for install (shallow): python3-module-sphinx-sphinx-build-symlink
[x86_64] MI2a: satisfying Depends: python3(isodate) < 0
[x86_64] MI2a: maybe install (a providing target): python3-module-isodate 0.7.2-alt1:sisyphus+360454.100.1.1 at 1729616035
[x86_64] MI2a: target SELECTED: python3-module-isodate 0.7.2-alt1:sisyphus+360454.100.1.1 at 1729616035
[x86_64] MI2a: requesting to install python3-module-isodate (unspec'd ver; inspect with Debug::pkgMark-shallow)
[x86_64] MI2a: marked for install (shallow): python3-module-isodate
[x86_64] MI2a: satisfying Depends: python3(pymongo) < 0
[x86_64] MI2a: maybe install (a providing target): python3-module-pymongo 4.11.3-alt1:sisyphus+378428.100.1.1 at 1742304871
[x86_64] MI2a: target SELECTED: python3-module-pymongo 4.11.3-alt1:sisyphus+378428.100.1.1 at 1742304871
[x86_64] MI2a: requesting to install python3-module-pymongo (unspec'd ver; inspect with Debug::pkgMark-shallow)
[x86_64] MI2a: marked for install (shallow): python3-module-pymongo
[x86_64] MI2a: satisfying Depends: python3(service_identity) < 0
[x86_64] MI2a: maybe install (a providing target): python3-module-service_identity 24.2.0-alt1:sisyphus+362235.100.1.1 at 1731336596
[x86_64] MI2a: target SELECTED: python3-module-service_identity 24.2.0-alt1:sisyphus+362235.100.1.1 at 1731336596
[x86_64] MI2a: requesting to install python3-module-service_identity (unspec'd ver; inspect with Debug::pkgMark-shallow)
[x86_64] MI2a: marked for install (shallow): python3-module-service_identity
[x86_64] MI2a: satisfying Depends: python3(pyasn1.codec.der.decoder) < 0
[x86_64] MI2a: maybe install (a providing target): python3-module-pyasn1 0.6.1-alt1:sisyphus+357301.100.1.1 at 1740397762
[x86_64] MI2a: target SELECTED: python3-module-pyasn1 0.6.1-alt1:sisyphus+357301.100.1.1 at 1740397762
[x86_64] MI2a: requesting to install python3-module-pyasn1 (unspec'd ver; inspect with Debug::pkgMark-shallow)
[x86_64] MI2a: marked for install (shallow): python3-module-pyasn1
[x86_64] MI2a: satisfying Depends: python3-module-bson = 4.11.3-alt1:sisyphus+378428.100.1.1
[x86_64] MI2a: maybe install (a direct target): python3-module-bson 4.11.3-alt1:sisyphus+378428.100.1.1 at 1742304871
[x86_64] MI2a: target SELECTED: python3-module-bson 4.11.3-alt1:sisyphus+378428.100.1.1 at 1742304871
[x86_64] MI2a: requesting to install python3-module-bson (unspec'd ver; inspect with Debug::pkgMark-shallow)
[x86_64] MI2a: marked for install (shallow): python3-module-bson
[x86_64] MI2a: satisfying Depends: python3(sqlalchemy) < 0
[x86_64] MI2a: maybe install (a providing target): python3-module-sqlalchemy 2.0.40-alt1:sisyphus+380006.100.1.1 at 1743586270
[x86_64] MI2a: target SELECTED: python3-module-sqlalchemy 2.0.40-alt1:sisyphus+380006.100.1.1 at 1743586270
[x86_64] MI2a: requesting to install python3-module-sqlalchemy (unspec'd ver; inspect with Debug::pkgMark-shallow)
[x86_64] MI2a: marked for install (shallow): python3-module-sqlalchemy
[x86_64] MI2a: satisfying Depends: python3-modules-sqlite3 (NULL)
[x86_64] MI2a: maybe install (a direct target): python3-modules-sqlite3 3.12.9-alt1:sisyphus+376344.100.1.1 at 1740741913
[x86_64] MI2a: target SELECTED: python3-modules-sqlite3 3.12.9-alt1:sisyphus+376344.100.1.1 at 1740741913
[x86_64] MI2a: requesting to install python3-modules-sqlite3 (unspec'd ver; inspect with Debug::pkgMark-shallow)
[x86_64] MI2a: marked for install (shallow): python3-modules-sqlite3
[x86_64] MI2a: satisfying Depends: libsqlite3.so.0()(64bit) >= set:ohbW8uvwE0AySekmaizOFVAhtivtNj465Jaq19KSn7gWBWHMZzUdeZFRZIlLMCDNHGfq3JQppRdwivwATaeCInZrCLJFYi1I6TwFGaoDiUzRZ0ZczZkNfeIbzVVIZphh6C0GhVy6OfMlkGjrO2NIBIVlSm2JbsGPotQwdzp8sw1iII7dAdkHysDJnhx5O8xXqZHCZBGY9zibimpwaELD9YJYj7rszqZ0oIoGBPSqUxjm3pXb0
[x86_64] MI2a: maybe install (a providing target): libsqlite3 3.47.1-alt1:sisyphus+375553.2600.2.1 at 1740149712
[x86_64] MI2a: target SELECTED: libsqlite3 3.47.1-alt1:sisyphus+375553.2600.2.1 at 1740149712
[x86_64] MI2a: requesting to install libsqlite3 (unspec'd ver; inspect with Debug::pkgMark-shallow)
[x86_64] MI2a: marked for install (shallow): libsqlite3
[x86_64] MI2a: satisfying Depends: python3(mypy) < 0
[x86_64] MI2a: maybe install (a providing target): python3-module-mypy 1.15.0-alt1:sisyphus+374439.100.1.1 at 1739354486
[x86_64] MI2a: target SELECTED: python3-module-mypy 1.15.0-alt1:sisyphus+374439.100.1.1 at 1739354486
[x86_64] MI2a: requesting to install python3-module-mypy (unspec'd ver; inspect with Debug::pkgMark-shallow)
[x86_64] MI2a: marked for install (shallow): python3-module-mypy
[x86_64] MI2a: satisfying Depends: python3-module-mypy-extensions (NULL)
[x86_64] MI2a: maybe install (a providing target): python3-module-mypy_extensions 1.0.0-alt1:sisyphus+316350.100.2.1 at 1678357948
[x86_64] MI2a: target SELECTED: python3-module-mypy_extensions 1.0.0-alt1:sisyphus+316350.100.2.1 at 1678357948
[x86_64] MI2a: requesting to install python3-module-mypy_extensions (unspec'd ver; inspect with Debug::pkgMark-shallow)
[x86_64] MI2a: marked for install (shallow): python3-module-mypy_extensions
[x86_64] MI2a: satisfying Depends: python3-module-billiard >= 3.6.3
[x86_64] MI2a: maybe install (a direct target): python3-module-billiard 4.2.1-alt1:sisyphus+378410.100.1.1 at 1742300465
[x86_64] MI2a: target SELECTED: python3-module-billiard 4.2.1-alt1:sisyphus+378410.100.1.1 at 1742300465
[x86_64] MI2a: requesting to install python3-module-billiard (unspec'd ver; inspect with Debug::pkgMark-shallow)
[x86_64] MI2a: marked for install (shallow): python3-module-billiard
[x86_64] MI2a: satisfying Depends: python3(click_didyoumean) < 0
[x86_64] MI2a: maybe install (a providing target): python3-module-click-didyoumean 0.3.1-alt1:sisyphus+359293.100.1.1 at 1728402783
[x86_64] MI2a: target SELECTED: python3-module-click-didyoumean 0.3.1-alt1:sisyphus+359293.100.1.1 at 1728402783
[x86_64] MI2a: requesting to install python3-module-click-didyoumean (unspec'd ver; inspect with Debug::pkgMark-shallow)
[x86_64] MI2a: marked for install (shallow): python3-module-click-didyoumean
[x86_64] MI2a: satisfying Depends: python3(click_plugins) < 0
[x86_64] MI2a: maybe install (a providing target): python3-module-click-plugins 1.1.1-alt1:sisyphus+336348.100.1.1 at 1702395075
[x86_64] MI2a: target SELECTED: python3-module-click-plugins 1.1.1-alt1:sisyphus+336348.100.1.1 at 1702395075
[x86_64] MI2a: requesting to install python3-module-click-plugins (unspec'd ver; inspect with Debug::pkgMark-shallow)
[x86_64] MI2a: marked for install (shallow): python3-module-click-plugins
[x86_64] MI2a: satisfying Depends: python3(click_repl) < 0
[x86_64] MI2a: maybe install (a providing target): python3-module-click-repl 0.3.0-alt2:sisyphus+359306.100.1.1 at 1728411020
[x86_64] MI2a: target SELECTED: python3-module-click-repl 0.3.0-alt2:sisyphus+359306.100.1.1 at 1728411020
[x86_64] MI2a: requesting to install python3-module-click-repl (unspec'd ver; inspect with Debug::pkgMark-shallow)
[x86_64] MI2a: marked for install (shallow): python3-module-click-repl
[x86_64] MI2a: satisfying Depends: python3-module-prompt_toolkit (NULL)
[x86_64] MI2a: maybe install (a direct target): python3-module-prompt_toolkit 3.0.50-alt1:sisyphus+370845.100.1.1 at 1737549300
[x86_64] MI2a: target SELECTED: python3-module-prompt_toolkit 3.0.50-alt1:sisyphus+370845.100.1.1 at 1737549300
[x86_64] MI2a: requesting to install python3-module-prompt_toolkit (unspec'd ver; inspect with Debug::pkgMark-shallow)
[x86_64] MI2a: marked for install (shallow): python3-module-prompt_toolkit
[x86_64] MI2a: satisfying Depends: python3(asyncssh) < 0
[x86_64] MI2a: maybe install (a providing target): python3-module-asyncssh 2.20.0-alt1:sisyphus+376138.100.1.1 at 1740553689
[x86_64] MI2a: target SELECTED: python3-module-asyncssh 2.20.0-alt1:sisyphus+376138.100.1.1 at 1740553689
[x86_64] MI2a: requesting to install python3-module-asyncssh (unspec'd ver; inspect with Debug::pkgMark-shallow)
[x86_64] MI2a: marked for install (shallow): python3-module-asyncssh
[x86_64] MI2a: satisfying Depends: python3-module-Crypto (NULL)
[x86_64] MI2a: maybe install (a providing target): python3-module-pycryptodome 3.22.0-alt1:sisyphus+378294.100.1.1 at 1742210220
[x86_64] MI2a: target SELECTED: python3-module-pycryptodome 3.22.0-alt1:sisyphus+378294.100.1.1 at 1742210220
[x86_64] MI2a: requesting to install python3-module-pycryptodome (unspec'd ver; inspect with Debug::pkgMark-shallow)
[x86_64] MI2a: marked for install (shallow): python3-module-pycryptodome
[x86_64] MI2a: satisfying Depends: python3(gssapi) < 0
[x86_64] MI2a: maybe install (a providing target): python3-module-gssapi 1.9.0-alt1:sisyphus+359349.100.1.1 at 1728472724
[x86_64] MI2a: target SELECTED: python3-module-gssapi 1.9.0-alt1:sisyphus+359349.100.1.1 at 1728472724
[x86_64] MI2a: requesting to install python3-module-gssapi (unspec'd ver; inspect with Debug::pkgMark-shallow)
[x86_64] MI2a: marked for install (shallow): python3-module-gssapi
[x86_64] MI2a: satisfying Depends: python3-module-decorator (NULL)
[x86_64] MI2a: maybe install (a direct target): python3-module-decorator 5.2.1-alt1:sisyphus+376067.100.1.1 at 1740491622
[x86_64] MI2a: target SELECTED: python3-module-decorator 5.2.1-alt1:sisyphus+376067.100.1.1 at 1740491622
[x86_64] MI2a: requesting to install python3-module-decorator (unspec'd ver; inspect with Debug::pkgMark-shallow)
[x86_64] MI2a: marked for install (shallow): python3-module-decorator
[x86_64] MI2a: satisfying Depends: python3(pyperclip) < 0
[x86_64] MI2a: maybe install (a providing target): python3-module-pyperclip 1.9.0-alt1:sisyphus+353859.100.1.1 at 1722231798
[x86_64] MI2a: target SELECTED: python3-module-pyperclip 1.9.0-alt1:sisyphus+353859.100.1.1 at 1722231798
[x86_64] MI2a: requesting to install python3-module-pyperclip (unspec'd ver; inspect with Debug::pkgMark-shallow)
[x86_64] MI2a: marked for install (shallow): python3-module-pyperclip
[x86_64] MI2a: satisfying Depends: python3(wcwidth) < 0
[x86_64] MI2a: maybe install (a providing target): python3-module-wcwidth 0.2.13-alt1:sisyphus+341792.100.2.1 at 1709543329
[x86_64] MI2a: target SELECTED: python3-module-wcwidth 0.2.13-alt1:sisyphus+341792.100.2.1 at 1709543329
[x86_64] MI2a: requesting to install python3-module-wcwidth (unspec'd ver; inspect with Debug::pkgMark-shallow)
[x86_64] MI2a: marked for install (shallow): python3-module-wcwidth
[x86_64] MI2a: satisfying Depends: python3(curses) < 0
[x86_64] MI2a: maybe install (a providing target): python3-modules-curses 3.12.9-alt1:sisyphus+376344.100.1.1 at 1740741913
[x86_64] MI2a: target SELECTED: python3-modules-curses 3.12.9-alt1:sisyphus+376344.100.1.1 at 1740741913
[x86_64] MI2a: requesting to install python3-modules-curses (unspec'd ver; inspect with Debug::pkgMark-shallow)
[x86_64] MI2a: marked for install (shallow): python3-modules-curses
[x86_64] MI2a: satisfying Depends: python3(pytest) < 0
[x86_64] MI2a: maybe install (a providing target): python3-module-pytest 8.3.5-alt1:sisyphus+376824.100.2.1 at 1741167719
[x86_64] MI2a: target SELECTED: python3-module-pytest 8.3.5-alt1:sisyphus+376824.100.2.1 at 1741167719
[x86_64] MI2a: requesting to install python3-module-pytest (unspec'd ver; inspect with Debug::pkgMark-shallow)
[x86_64] MI2a: marked for install (shallow): python3-module-pytest
[x86_64] MI2a: satisfying Depends: python3-module-iniconfig (NULL)
[x86_64] MI2a: maybe install (a direct target): python3-module-iniconfig 2.1.0-alt1:sisyphus+378658.100.2.1 at 1742493599
[x86_64] MI2a: target SELECTED: python3-module-iniconfig 2.1.0-alt1:sisyphus+378658.100.2.1 at 1742493599
[x86_64] MI2a: requesting to install python3-module-iniconfig (unspec'd ver; inspect with Debug::pkgMark-shallow)
[x86_64] MI2a: marked for install (shallow): python3-module-iniconfig
[x86_64] MI2a: satisfying Depends: python3-module-pluggy (NULL)
[x86_64] MI2a: maybe install (a direct target): python3-module-pluggy 1.5.0-alt1:sisyphus+345632.100.2.1 at 1713864244
[x86_64] MI2a: target SELECTED: python3-module-pluggy 1.5.0-alt1:sisyphus+345632.100.2.1 at 1713864244
[x86_64] MI2a: requesting to install python3-module-pluggy (unspec'd ver; inspect with Debug::pkgMark-shallow)
[x86_64] MI2a: marked for install (shallow): python3-module-pluggy
[x86_64] MI2a: satisfying Depends: python3(django.conf) < 0
[x86_64] MI2a: maybe install (a providing target): python3-module-django 5.1.7-alt1:sisyphus+377889.100.1.1 at 1742236179
[x86_64] MI2a: target SELECTED: python3-module-django 5.1.7-alt1:sisyphus+377889.100.1.1 at 1742236179
[x86_64] MI2a: requesting to install python3-module-django (unspec'd ver; inspect with Debug::pkgMark-shallow)
[x86_64] MI2a: marked for install (shallow): python3-module-django
[x86_64] MI2a: satisfying Depends: python3(sqlparse) < 0
[x86_64] MI2a: maybe install (a providing target): python3-module-sqlparse 0.5.3-alt1:sisyphus+367438.100.1.1 at 1735561443
[x86_64] MI2a: target SELECTED: python3-module-sqlparse 0.5.3-alt1:sisyphus+367438.100.1.1 at 1735561443
[x86_64] MI2a: requesting to install python3-module-sqlparse (unspec'd ver; inspect with Debug::pkgMark-shallow)
[x86_64] MI2a: marked for install (shallow): python3-module-sqlparse
[x86_64] MI2a: satisfying Depends: python3(yaml) < 0
[x86_64] MI2a: maybe install (a providing target): python3-module-yaml 6.0.2-alt1:sisyphus+356896.100.1.1 at 1725541112
[x86_64] MI2a: target SELECTED: python3-module-yaml 6.0.2-alt1:sisyphus+356896.100.1.1 at 1725541112
[x86_64] MI2a: requesting to install python3-module-yaml (unspec'd ver; inspect with Debug::pkgMark-shallow)
[x86_64] MI2a: marked for install (shallow): python3-module-yaml
[x86_64] MI2a: satisfying Depends: libyaml-0.so.2()(64bit) >= set:jeDuSUAbEuz1xrY3muBZ56F9Jbi2W3kR6iB5oRQxGfDDGyazcKxJ4shcJWS8IVb7
[x86_64] MI2a: maybe install (a providing target): libyaml2 0.2.5-alt1:sisyphus+278391.100.1.1 at 1626094928
[x86_64] MI2a: target SELECTED: libyaml2 0.2.5-alt1:sisyphus+278391.100.1.1 at 1626094928
[x86_64] MI2a: requesting to install libyaml2 (unspec'd ver; inspect with Debug::pkgMark-shallow)
[x86_64] MI2a: marked for install (shallow): libyaml2
[x86_64] MI2a: satisfying Depends: python3-module-django-dbbackend-postgresql = 5.1.7-alt1:sisyphus+377889.100.1.1
[x86_64] MI2a: maybe install (a direct target): python3-module-django-dbbackend-postgresql 5.1.7-alt1:sisyphus+377889.100.1.1 at 1742236179
[x86_64] MI2a: target SELECTED: python3-module-django-dbbackend-postgresql 5.1.7-alt1:sisyphus+377889.100.1.1 at 1742236179
[x86_64] MI2a: requesting to install python3-module-django-dbbackend-postgresql (unspec'd ver; inspect with Debug::pkgMark-shallow)
[x86_64] MI2a: marked for install (shallow): python3-module-django-dbbackend-postgresql
[x86_64] MI2a: satisfying Depends: python3(exam) < 0
[x86_64] MI2a: maybe install (a providing target): python3-module-exam 0.10.6-alt5:sisyphus+338696.100.1.1 at 1705980836
[x86_64] MI2a: target SELECTED: python3-module-exam 0.10.6-alt5:sisyphus+338696.100.1.1 at 1705980836
[x86_64] MI2a: requesting to install python3-module-exam (unspec'd ver; inspect with Debug::pkgMark-shallow)
[x86_64] MI2a: marked for install (shallow): python3-module-exam
[x86_64] MI2a: satisfying Depends: python3(flask.signals) < 0
[x86_64] MI2a: maybe install (a providing target): python3-module-flask 3.1.0-alt1:sisyphus+362571.400.7.1 at 1734000837
[x86_64] MI2a: target SELECTED: python3-module-flask 3.1.0-alt1:sisyphus+362571.400.7.1 at 1734000837
[x86_64] MI2a: requesting to install python3-module-flask (unspec'd ver; inspect with Debug::pkgMark-shallow)
[x86_64] MI2a: marked for install (shallow): python3-module-flask
[x86_64] MI2a: satisfying Depends: python3-module-itsdangerous (NULL)
[x86_64] MI2a: maybe install (a direct target): python3-module-itsdangerous 2.2.0-alt1:sisyphus+345793.200.2.1 at 1714032239
[x86_64] MI2a: target SELECTED: python3-module-itsdangerous 2.2.0-alt1:sisyphus+345793.200.2.1 at 1714032239
[x86_64] MI2a: requesting to install python3-module-itsdangerous (unspec'd ver; inspect with Debug::pkgMark-shallow)
[x86_64] MI2a: marked for install (shallow): python3-module-itsdangerous
[x86_64] MI2a: satisfying Depends: python3-module-werkzeug (NULL)
[x86_64] MI2a: maybe install (a direct target): python3-module-werkzeug 3.1.3-alt1:sisyphus+361875.200.2.1 at 1731337173
[x86_64] MI2a: target SELECTED: python3-module-werkzeug 3.1.3-alt1:sisyphus+361875.200.2.1 at 1731337173
[x86_64] MI2a: requesting to install python3-module-werkzeug (unspec'd ver; inspect with Debug::pkgMark-shallow)
[x86_64] MI2a: marked for install (shallow): python3-module-werkzeug
[x86_64] MI2a: satisfying Depends: python3(web) < 0
[x86_64] MI2a: maybe install (a providing target): python3-module-webpy 0.62-alt1:sisyphus+291589.100.1.1 at 1638900041
[x86_64] MI2a: target SELECTED: python3-module-webpy 0.62-alt1:sisyphus+291589.100.1.1 at 1638900041
[x86_64] MI2a: requesting to install python3-module-webpy (unspec'd ver; inspect with Debug::pkgMark-shallow)
[x86_64] MI2a: marked for install (shallow): python3-module-webpy
[x86_64] MI2a: satisfying Depends: python3(uvicorn.config) < 0
[x86_64] MI2a: maybe install (a providing target): python3-module-uvicorn 0.32.0-alt1:sisyphus+362344.100.1.2 at 1731416048
[x86_64] MI2a: target SELECTED: python3-module-uvicorn 0.32.0-alt1:sisyphus+362344.100.1.2 at 1731416048
[x86_64] MI2a: requesting to install python3-module-uvicorn (unspec'd ver; inspect with Debug::pkgMark-shallow)
[x86_64] MI2a: marked for install (shallow): python3-module-uvicorn
[x86_64] MI2a: satisfying Depends: python3(h11) < 0
[x86_64] MI2a: maybe install (a providing target): python3-module-h11 0.14.0-alt1:sisyphus+312690.100.1.1 at 1672395335
[x86_64] MI2a: target SELECTED: python3-module-h11 0.14.0-alt1:sisyphus+312690.100.1.1 at 1672395335
[x86_64] MI2a: requesting to install python3-module-h11 (unspec'd ver; inspect with Debug::pkgMark-shallow)
[x86_64] MI2a: marked for install (shallow): python3-module-h11
[x86_64] MI2a: satisfying Depends: python3(httptools) < 0
[x86_64] MI2a: maybe install (a providing target): python3-module-httptools 0.6.4-alt1:sisyphus+360443.100.1.1 at 1729609752
[x86_64] MI2a: target SELECTED: python3-module-httptools 0.6.4-alt1:sisyphus+360443.100.1.1 at 1729609752
[x86_64] MI2a: requesting to install python3-module-httptools (unspec'd ver; inspect with Debug::pkgMark-shallow)
[x86_64] MI2a: marked for install (shallow): python3-module-httptools
[x86_64] MI2a: satisfying Depends: libhttp_parser.so.2.9()(64bit) >= set:hfh6pK1
[x86_64] MI2a: maybe install (a providing target): libhttp-parser 2.9.4-alt2:sisyphus+279479.100.1.1 at 1626549243
[x86_64] MI2a: target SELECTED: libhttp-parser 2.9.4-alt2:sisyphus+279479.100.1.1 at 1626549243
[x86_64] MI2a: requesting to install libhttp-parser (unspec'd ver; inspect with Debug::pkgMark-shallow)
[x86_64] MI2a: marked for install (shallow): libhttp-parser
[x86_64] MI2a: satisfying Depends: python3(uvloop) < 0
[x86_64] MI2a: maybe install (a providing target): python3-module-uvloop 0.21.0-alt2:sisyphus+360737.200.1.1 at 1730313489
[x86_64] MI2a: target SELECTED: python3-module-uvloop 0.21.0-alt2:sisyphus+360737.200.1.1 at 1730313489
[x86_64] MI2a: requesting to install python3-module-uvloop (unspec'd ver; inspect with Debug::pkgMark-shallow)
[x86_64] MI2a: marked for install (shallow): python3-module-uvloop
[x86_64] MI2a: satisfying Depends: python3(watchfiles) < 0
[x86_64] MI2a: maybe install (a providing target): python3-module-watchfiles 0.21.0-alt2:sisyphus+345606.100.1.1 at 1713774127
[x86_64] MI2a: target SELECTED: python3-module-watchfiles 0.21.0-alt2:sisyphus+345606.100.1.1 at 1713774127
[x86_64] MI2a: requesting to install python3-module-watchfiles (unspec'd ver; inspect with Debug::pkgMark-shallow)
[x86_64] MI2a: marked for install (shallow): python3-module-watchfiles
[x86_64] MI2a: satisfying Depends: python3(anyio) < 0
[x86_64] MI2a: maybe install (a providing target): python3-module-anyio 4.8.0-alt2:sisyphus+376617.100.1.1 at 1740870933
[x86_64] MI2a: target SELECTED: python3-module-anyio 4.8.0-alt2:sisyphus+376617.100.1.1 at 1740870933
[x86_64] MI2a: requesting to install python3-module-anyio (unspec'd ver; inspect with Debug::pkgMark-shallow)
[x86_64] MI2a: marked for install (shallow): python3-module-anyio
[x86_64] MI2a: satisfying Depends: python3(watchgod) < 0
[x86_64] MI2a: maybe install (a providing target): python3-module-watchgod 0.7-alt1:sisyphus+266224.300.1.1 at 1613128283
[x86_64] MI2a: target SELECTED: python3-module-watchgod 0.7-alt1:sisyphus+266224.300.1.1 at 1613128283
[x86_64] MI2a: requesting to install python3-module-watchgod (unspec'd ver; inspect with Debug::pkgMark-shallow)
[x86_64] MI2a: marked for install (shallow): python3-module-watchgod
[x86_64] MI2a: satisfying Depends: python3(websockets) < 0
[x86_64] MI2a: maybe install (a providing target): python3-module-websockets 14.1-alt1:sisyphus+369527.100.1.1 at 1736868330
[x86_64] MI2a: target SELECTED: python3-module-websockets 14.1-alt1:sisyphus+369527.100.1.1 at 1736868330
[x86_64] MI2a: requesting to install python3-module-websockets (unspec'd ver; inspect with Debug::pkgMark-shallow)
[x86_64] MI2a: marked for install (shallow): python3-module-websockets
[x86_64] MI2a: satisfying Depends: python3(wsproto) < 0
[x86_64] MI2a: maybe install (a providing target): python3-module-wsproto 1.2.0-alt1:sisyphus+309644.100.1.2 at 1667834502
[x86_64] MI2a: target SELECTED: python3-module-wsproto 1.2.0-alt1:sisyphus+309644.100.1.2 at 1667834502
[x86_64] MI2a: requesting to install python3-module-wsproto (unspec'd ver; inspect with Debug::pkgMark-shallow)
[x86_64] MI2a: marked for install (shallow): python3-module-wsproto
[x86_64] rpm-build-pyproject is already the newest version.
[x86_64] E: Couldn't find package python3-module-markdown-pytest
[x86_64] hsh-install: Failed to calculate package file list.
[x86_64] hsh-install: Failed to generate package file list.
2025-Apr-02 15:13:42 :: [x86_64] python3-module-aiofile.git 3.9.0-alt1: remote: cannot build src.rpm
2025-Apr-02 15:13:42 :: [x86_64] #500 python3-module-aiofile.git 3.9.0-alt1: build FAILED
2025-Apr-02 15:13:50 :: [aarch64] #300 python3-module-aiomisc-pytest.git 1.2.1-alt1: build OK
2025-Apr-02 15:13:51 :: [aarch64] task processing CANCELLED
2025-Apr-02 15:13:38 :: [i586] build FAILED
2025-Apr-02 15:13:42 :: [x86_64] build FAILED
2025-Apr-02 15:13:51 :: [aarch64] build FAILED
2025-Apr-02 15:13:51 :: task #380033 for sisyphus FAILED
More information about the Sisyphus-incominger
mailing list