[#379968] FAILED python3-module-proglog.git=0.1.11-alt1
Girar awaiter (cas)
girar-builder at altlinux.org
Wed Apr 2 06:34:36 MSK 2025
https://git.altlinux.org/tasks/379968/logs/events.1.1.log
https://packages.altlinux.org/tasks/379968
subtask name aarch64 i586 x86_64
#100 python3-module-proglog failed failed failed
2025-Apr-02 03:34:02 :: task #379968 for sisyphus started by cas:
#100 build 0.1.11-alt1 from /people/cas/packages/python3-module-proglog.git fetched at 2025-Apr-02 03:34:00
2025-Apr-02 03:34:03 :: [aarch64] #100 python3-module-proglog.git 0.1.11-alt1: build start
2025-Apr-02 03:34:03 :: [i586] #100 python3-module-proglog.git 0.1.11-alt1: build start
2025-Apr-02 03:34:03 :: [x86_64] #100 python3-module-proglog.git 0.1.11-alt1: build start
[x86_64] INFO : backend_caller.py : Hook kwargs: {'config_settings': None}
[x86_64] DEBUG : setuptools.config.pyprojecttoml : configuration error: `project.license` must be valid exactly by one definition (2 matches found):
[x86_64] - keys:
[x86_64] --
[x86_64] raise ValueError(f"{error}\n{summary}") from None
[x86_64] ValueError: invalid pyproject.toml config: `project.license`.
[x86_64] configuration error: `project.license` must be valid exactly by one definition (2 matches found):
[x86_64] - keys:
[x86_64] --
[x86_64] raise RuntimeError(err_msg) from None
[x86_64] RuntimeError: build_wheel failed
2025-Apr-02 03:34:24 :: [x86_64] python3-module-proglog.git 0.1.11-alt1: remote: build failed
2025-Apr-02 03:34:24 :: [x86_64] #100 python3-module-proglog.git 0.1.11-alt1: build FAILED
2025-Apr-02 03:34:24 :: [x86_64] requesting cancellation of task processing
[i586] INFO : backend_caller.py : Hook kwargs: {'config_settings': None}
[i586] DEBUG : setuptools.config.pyprojecttoml : configuration error: `project.license` must be valid exactly by one definition (2 matches found):
[i586] - keys:
[i586] --
[i586] raise ValueError(f"{error}\n{summary}") from None
[i586] ValueError: invalid pyproject.toml config: `project.license`.
[i586] configuration error: `project.license` must be valid exactly by one definition (2 matches found):
[i586] - keys:
[i586] --
[i586] raise RuntimeError(err_msg) from None
[i586] RuntimeError: build_wheel failed
2025-Apr-02 03:34:28 :: [i586] python3-module-proglog.git 0.1.11-alt1: remote: build failed
2025-Apr-02 03:34:28 :: [i586] #100 python3-module-proglog.git 0.1.11-alt1: build FAILED
[aarch64] INFO : backend_caller.py : Hook kwargs: {'config_settings': None}
[aarch64] DEBUG : setuptools.config.pyprojecttoml : configuration error: `project.license` must be valid exactly by one definition (2 matches found):
[aarch64] - keys:
[aarch64] --
[aarch64] raise ValueError(f"{error}\n{summary}") from None
[aarch64] ValueError: invalid pyproject.toml config: `project.license`.
[aarch64] configuration error: `project.license` must be valid exactly by one definition (2 matches found):
[aarch64] - keys:
[aarch64] --
[aarch64] raise RuntimeError(err_msg) from None
[aarch64] RuntimeError: build_wheel failed
2025-Apr-02 03:34:35 :: [aarch64] python3-module-proglog.git 0.1.11-alt1: remote: build failed
2025-Apr-02 03:34:35 :: [aarch64] #100 python3-module-proglog.git 0.1.11-alt1: build FAILED
2025-Apr-02 03:34:24 :: [x86_64] build FAILED
2025-Apr-02 03:34:28 :: [i586] build FAILED
2025-Apr-02 03:34:35 :: [aarch64] build FAILED
2025-Apr-02 03:34:35 :: task #379968 for sisyphus FAILED
More information about the Sisyphus-incominger
mailing list