[#379952] [test-only] FAILED kernel-modules.git=sisyphus/kernel-modules-LiME-6.12-1.9.1-alt1

Girar awaiter (manowar) girar-builder at altlinux.org
Tue Apr 1 21:07:36 MSK 2025


https://git.altlinux.org/tasks/379952/logs/events.1.1.log
https://packages.altlinux.org/tasks/379952

subtask  name                       aarch64  i586  x86_64
   #100  @kernel-modules-LiME-6.12   failed    31      31

2025-Apr-01 18:06:58 :: test-only task #379952 for sisyphus started by manowar:
#100 build sisyphus/kernel-modules-LiME-6.12-1.9.1-alt1 from /people/manowar/packages/kernel-modules.git fetched at 2025-Apr-01 18:06:53
2025-Apr-01 18:07:00 :: [aarch64] #100 kernel-modules.git sisyphus/kernel-modules-LiME-6.12-1.9.1-alt1: build start
2025-Apr-01 18:07:00 :: [x86_64] #100 kernel-modules.git sisyphus/kernel-modules-LiME-6.12-1.9.1-alt1: build start
2025-Apr-01 18:07:00 :: [i586] #100 kernel-modules.git sisyphus/kernel-modules-LiME-6.12-1.9.1-alt1: build start
2025-Apr-01 18:07:31 :: [x86_64] #100 kernel-modules.git sisyphus/kernel-modules-LiME-6.12-1.9.1-alt1: build OK
2025-Apr-01 18:07:31 :: [i586] #100 kernel-modules.git sisyphus/kernel-modules-LiME-6.12-1.9.1-alt1: build OK
[aarch64] /usr/src/RPM/BUILD/kernel-source-LiME-1.9.1/hash.c: In function 'ldigest_update':
[aarch64] ./arch/arm64/include/asm/memory.h:427:66: error: passing argument 1 of 'virt_to_pfn' makes pointer from integer without a cast [-Wint-conversion]
[aarch64]   427 |         __is_lm_address(__addr) && pfn_is_map_memory(virt_to_pfn(__addr));      \
2025-Apr-01 18:07:36 :: [aarch64] kernel-modules.git sisyphus/kernel-modules-LiME-6.12-1.9.1-alt1: remote: build failed
2025-Apr-01 18:07:36 :: [aarch64] #100 kernel-modules.git sisyphus/kernel-modules-LiME-6.12-1.9.1-alt1: build FAILED
2025-Apr-01 18:07:36 :: [aarch64] requesting cancellation of task processing
2025-Apr-01 18:07:36 :: [aarch64] build FAILED
2025-Apr-01 18:07:36 :: task #379952 for sisyphus FAILED


More information about the Sisyphus-incominger mailing list