[#304631] [test-only] FAILED (try 9) kernel-image.git=kernel-image-un-def-5.19.0-alt1 ...

Girar awaiter (vt) girar-builder at altlinux.org
Tue Aug 2 18:18:55 MSK 2022


https://git.altlinux.org/tasks/304631/logs/events.9.1.log

subtask  name                                       aarch64  armh    i586  ppc64le  x86_64
  #2000  kernel-modules-virtualbox-addition-un-def        -     -  failed        -  failed

2022-Aug-02 15:17:00 :: test-only task #304631 for sisyphus resumed by vt:
2022-Aug-02 15:17:00 :: message: kmodules:kernel-image-un-def-5.19.0-alt1
#100 build kernel-image-un-def-5.19.0-alt1 from /people/vt/packages/kernel-image.git fetched at 2022-Aug-01 22:51:41
#200 removed
#300 removed
#400 removed
#500 removed
#600 removed
#700 removed
#1000 removed
#1100 removed
#1200 removed
#1300 removed
#1400 removed
#1500 removed
#1600 removed
#1700 removed
#2000 build sisyphus/kernel-modules-virtualbox-addition-un-def-6.1.36-alt1 from /gears/k/kernel-modules-virtualbox-addition-un-def.git fetched at 2022-Aug-01 22:52:33 from sisyphus
#2100 build sisyphus/kernel-modules-virtualbox-un-def-6.1.36-alt1 from /gears/k/kernel-modules-virtualbox-un-def.git fetched at 2022-Aug-01 22:52:40 from sisyphus
#2200 removed
2022-Aug-02 15:17:00 :: created build repo
2022-Aug-02 15:17:01 :: #2000: force rebuild
2022-Aug-02 15:17:01 :: #2100: force rebuild
2022-Aug-02 15:17:01 :: [x86_64] #100 kernel-image.git kernel-image-un-def-5.19.0-alt1: build start
2022-Aug-02 15:17:01 :: [aarch64] #100 kernel-image.git kernel-image-un-def-5.19.0-alt1: build start
2022-Aug-02 15:17:01 :: [i586] #100 kernel-image.git kernel-image-un-def-5.19.0-alt1: build start
2022-Aug-02 15:17:01 :: [ppc64le] #100 kernel-image.git kernel-image-un-def-5.19.0-alt1: build start
2022-Aug-02 15:17:01 :: [armh] #100 kernel-image.git kernel-image-un-def-5.19.0-alt1: build start
2022-Aug-02 15:17:17 :: [i586] #100 kernel-image.git kernel-image-un-def-5.19.0-alt1: build OK (cached)
2022-Aug-02 15:17:17 :: [i586] #2000 kernel-modules-virtualbox-addition-un-def.git sisyphus/kernel-modules-virtualbox-addition-un-def-6.1.36-alt1: build start
2022-Aug-02 15:17:17 :: [x86_64] #100 kernel-image.git kernel-image-un-def-5.19.0-alt1: build OK (cached)
2022-Aug-02 15:17:18 :: [x86_64] #2000 kernel-modules-virtualbox-addition-un-def.git sisyphus/kernel-modules-virtualbox-addition-un-def-6.1.36-alt1: build start
2022-Aug-02 15:17:29 :: [aarch64] #100 kernel-image.git kernel-image-un-def-5.19.0-alt1: build OK (cached)
2022-Aug-02 15:17:29 :: [aarch64] #2000 kernel-modules-virtualbox-addition-un-def.git sisyphus/kernel-modules-virtualbox-addition-un-def-6.1.36-alt1: build start
2022-Aug-02 15:17:30 :: [ppc64le] #100 kernel-image.git kernel-image-un-def-5.19.0-alt1: build OK (cached)
2022-Aug-02 15:17:30 :: [ppc64le] #2000 kernel-modules-virtualbox-addition-un-def.git sisyphus/kernel-modules-virtualbox-addition-un-def-6.1.36-alt1: build start
[x86_64] echo >&2;							\
[x86_64] echo >&2 "  ERROR: Kernel configuration is invalid.";		\
[x86_64] echo >&2 "         include/generated/autoconf.h or include/config/auto.conf are missing.";\
[x86_64] --
[x86_64]   ./scripts/check-local-export /usr/src/RPM/BUILD/kernel-source-virtualbox-addition-6.1.36/kernel-source-vboxguest-6.1.36/common/string/strformatrt.o
[x86_64] /bin/sh: ./scripts/check-local-export: No such file or directory
[x86_64] make[2]: *** [scripts/Makefile.build:249: /usr/src/RPM/BUILD/kernel-source-virtualbox-addition-6.1.36/kernel-source-vboxguest-6.1.36/common/string/strformatrt.o] Error 127
[x86_64] --
[x86_64]   ./scripts/check-local-export /usr/src/RPM/BUILD/kernel-source-virtualbox-addition-6.1.36/kernel-source-vboxguest-6.1.36/VBoxGuest-linux.o
[x86_64] /bin/sh: ./scripts/check-local-export: No such file or directory
[x86_64] make[2]: *** [scripts/Makefile.build:249: /usr/src/RPM/BUILD/kernel-source-virtualbox-addition-6.1.36/kernel-source-vboxguest-6.1.36/VBoxGuest-linux.o] Error 127
[x86_64] --
[x86_64]   ./scripts/check-local-export /usr/src/RPM/BUILD/kernel-source-virtualbox-addition-6.1.36/kernel-source-vboxguest-6.1.36/VBoxGuest.o
[x86_64] /bin/sh: ./scripts/check-local-export: No such file or directory
[x86_64] make[2]: *** [scripts/Makefile.build:249: /usr/src/RPM/BUILD/kernel-source-virtualbox-addition-6.1.36/kernel-source-vboxguest-6.1.36/VBoxGuest.o] Error 127
[x86_64] --
[x86_64]   ./scripts/check-local-export /usr/src/RPM/BUILD/kernel-source-virtualbox-addition-6.1.36/kernel-source-vboxguest-6.1.36/combined-os-specific.o
[x86_64] /bin/sh: ./scripts/check-local-export: No such file or directory
[x86_64] make[2]: *** [scripts/Makefile.build:249: /usr/src/RPM/BUILD/kernel-source-virtualbox-addition-6.1.36/kernel-source-vboxguest-6.1.36/combined-os-specific.o] Error 127
[x86_64] --
[x86_64]   ./scripts/check-local-export /usr/src/RPM/BUILD/kernel-source-virtualbox-addition-6.1.36/kernel-source-vboxguest-6.1.36/combined-agnostic.o
[x86_64] /bin/sh: ./scripts/check-local-export: No such file or directory
[x86_64] make[2]: *** [scripts/Makefile.build:249: /usr/src/RPM/BUILD/kernel-source-virtualbox-addition-6.1.36/kernel-source-vboxguest-6.1.36/combined-agnostic.o] Error 127
2022-Aug-02 15:17:35 :: [x86_64] kernel-modules-virtualbox-addition-un-def.git sisyphus/kernel-modules-virtualbox-addition-un-def-6.1.36-alt1: remote: build failed
2022-Aug-02 15:17:35 :: [x86_64] #2000 kernel-modules-virtualbox-addition-un-def.git sisyphus/kernel-modules-virtualbox-addition-un-def-6.1.36-alt1: build FAILED
[i586] echo >&2;							\
[i586] echo >&2 "  ERROR: Kernel configuration is invalid.";		\
[i586] echo >&2 "         include/generated/autoconf.h or include/config/auto.conf are missing.";\
[i586] --
[i586]   ./scripts/check-local-export /usr/src/RPM/BUILD/kernel-source-virtualbox-addition-6.1.36/kernel-source-vboxguest-6.1.36/common/math/gcc/divdi3.o
[i586] /bin/sh: ./scripts/check-local-export: No such file or directory
[i586] make[2]: *** [scripts/Makefile.build:249: /usr/src/RPM/BUILD/kernel-source-virtualbox-addition-6.1.36/kernel-source-vboxguest-6.1.36/common/math/gcc/divdi3.o] Error 127
[i586] --
[i586]   ./scripts/check-local-export /usr/src/RPM/BUILD/kernel-source-virtualbox-addition-6.1.36/kernel-source-vboxguest-6.1.36/common/math/gcc/umoddi3.o
[i586] /bin/sh: ./scripts/check-local-export: No such file or directory
[i586] make[2]: *** [scripts/Makefile.build:249: /usr/src/RPM/BUILD/kernel-source-virtualbox-addition-6.1.36/kernel-source-vboxguest-6.1.36/common/math/gcc/umoddi3.o] Error 127
[i586] --
[i586]   ./scripts/check-local-export /usr/src/RPM/BUILD/kernel-source-virtualbox-addition-6.1.36/kernel-source-vboxguest-6.1.36/common/math/gcc/moddi3.o
[i586] /bin/sh: ./scripts/check-local-export: No such file or directory
[i586] make[2]: *** [scripts/Makefile.build:249: /usr/src/RPM/BUILD/kernel-source-virtualbox-addition-6.1.36/kernel-source-vboxguest-6.1.36/common/math/gcc/moddi3.o] Error 127
[i586] --
[i586]   ./scripts/check-local-export /usr/src/RPM/BUILD/kernel-source-virtualbox-addition-6.1.36/kernel-source-vboxguest-6.1.36/common/math/gcc/udivdi3.o
[i586] /bin/sh: ./scripts/check-local-export: No such file or directory
[i586] make[2]: *** [scripts/Makefile.build:249: /usr/src/RPM/BUILD/kernel-source-virtualbox-addition-6.1.36/kernel-source-vboxguest-6.1.36/common/math/gcc/udivdi3.o] Error 127
[i586] --
[i586]   ./scripts/check-local-export /usr/src/RPM/BUILD/kernel-source-virtualbox-addition-6.1.36/kernel-source-vboxguest-6.1.36/common/math/gcc/divmoddi4.o
[i586] /bin/sh: ./scripts/check-local-export: No such file or directory
[i586] make[2]: *** [scripts/Makefile.build:249: /usr/src/RPM/BUILD/kernel-source-virtualbox-addition-6.1.36/kernel-source-vboxguest-6.1.36/common/math/gcc/divmoddi4.o] Error 127
[i586] --
[i586]   ./scripts/check-local-export /usr/src/RPM/BUILD/kernel-source-virtualbox-addition-6.1.36/kernel-source-vboxguest-6.1.36/common/math/gcc/udivmoddi4.o
[i586] /bin/sh: ./scripts/check-local-export: No such file or directory
[i586] make[2]: *** [scripts/Makefile.build:249: /usr/src/RPM/BUILD/kernel-source-virtualbox-addition-6.1.36/kernel-source-vboxguest-6.1.36/common/math/gcc/udivmoddi4.o] Error 127
[i586] --
[i586]   ./scripts/check-local-export /usr/src/RPM/BUILD/kernel-source-virtualbox-addition-6.1.36/kernel-source-vboxguest-6.1.36/common/math/gcc/qdivrem.o
[i586] /bin/sh: ./scripts/check-local-export: No such file or directory
[i586] make[2]: *** [scripts/Makefile.build:249: /usr/src/RPM/BUILD/kernel-source-virtualbox-addition-6.1.36/kernel-source-vboxguest-6.1.36/common/math/gcc/qdivrem.o] Error 127
[i586] --
[i586]   ./scripts/check-local-export /usr/src/RPM/BUILD/kernel-source-virtualbox-addition-6.1.36/kernel-source-vboxguest-6.1.36/common/string/strformatrt.o
[i586] /bin/sh: ./scripts/check-local-export: No such file or directory
[i586] make[2]: *** [scripts/Makefile.build:249: /usr/src/RPM/BUILD/kernel-source-virtualbox-addition-6.1.36/kernel-source-vboxguest-6.1.36/common/string/strformatrt.o] Error 127
[i586] --
[i586]   ./scripts/check-local-export /usr/src/RPM/BUILD/kernel-source-virtualbox-addition-6.1.36/kernel-source-vboxguest-6.1.36/VBoxGuest-linux.o
[i586] /bin/sh: ./scripts/check-local-export: No such file or directory
[i586] make[2]: *** [scripts/Makefile.build:249: /usr/src/RPM/BUILD/kernel-source-virtualbox-addition-6.1.36/kernel-source-vboxguest-6.1.36/VBoxGuest-linux.o] Error 127
2022-Aug-02 15:17:37 :: [i586] kernel-modules-virtualbox-addition-un-def.git sisyphus/kernel-modules-virtualbox-addition-un-def-6.1.36-alt1: remote: build failed
2022-Aug-02 15:17:37 :: [i586] #2000 kernel-modules-virtualbox-addition-un-def.git sisyphus/kernel-modules-virtualbox-addition-un-def-6.1.36-alt1: build FAILED
2022-Aug-02 15:17:43 :: [armh] #100 kernel-image.git kernel-image-un-def-5.19.0-alt1: build OK (cached)
2022-Aug-02 15:17:43 :: [armh] #2000 kernel-modules-virtualbox-addition-un-def.git sisyphus/kernel-modules-virtualbox-addition-un-def-6.1.36-alt1: build start
2022-Aug-02 15:17:51 :: [aarch64] #2000 kernel-modules-virtualbox-addition-un-def.git sisyphus/kernel-modules-virtualbox-addition-un-def-6.1.36-alt1: build SKIPPED
2022-Aug-02 15:17:51 :: [aarch64] #2100 kernel-modules-virtualbox-un-def.git sisyphus/kernel-modules-virtualbox-un-def-6.1.36-alt1: build start
2022-Aug-02 15:17:56 :: [ppc64le] #2000 kernel-modules-virtualbox-addition-un-def.git sisyphus/kernel-modules-virtualbox-addition-un-def-6.1.36-alt1: build SKIPPED
2022-Aug-02 15:17:56 :: [ppc64le] #2100 kernel-modules-virtualbox-un-def.git sisyphus/kernel-modules-virtualbox-un-def-6.1.36-alt1: build start
2022-Aug-02 15:18:14 :: [aarch64] #2100 kernel-modules-virtualbox-un-def.git sisyphus/kernel-modules-virtualbox-un-def-6.1.36-alt1: build SKIPPED
2022-Aug-02 15:18:19 :: [armh] #2000 kernel-modules-virtualbox-addition-un-def.git sisyphus/kernel-modules-virtualbox-addition-un-def-6.1.36-alt1: build SKIPPED
2022-Aug-02 15:18:19 :: [armh] #2100 kernel-modules-virtualbox-un-def.git sisyphus/kernel-modules-virtualbox-un-def-6.1.36-alt1: build start
2022-Aug-02 15:18:22 :: [ppc64le] #2100 kernel-modules-virtualbox-un-def.git sisyphus/kernel-modules-virtualbox-un-def-6.1.36-alt1: build SKIPPED
2022-Aug-02 15:18:55 :: [armh] #2100 kernel-modules-virtualbox-un-def.git sisyphus/kernel-modules-virtualbox-un-def-6.1.36-alt1: build SKIPPED
2022-Aug-02 15:17:36 :: [x86_64] build FAILED
2022-Aug-02 15:17:37 :: [i586] build FAILED
2022-Aug-02 15:18:55 :: task #304631 for sisyphus FAILED


More information about the Sisyphus-incominger mailing list