[#233549] [test-only] FAILED (try 2) del=python-module-attest del=python-module-brownie ...

Girar Builder awaiter robot girar-builder at altlinux.org
Mon Jul 1 23:32:31 MSK 2019


http://git.altlinux.org/tasks/233549/logs/events.2.1.log

2019-Jul-01 20:29:44 :: test-only task #233549 for sisyphus resumed by lav:
#100 delete python-module-attest
#200 delete python-module-brownie
#240 build 2.0.4-alt1 from /people/lav/packages/python-module-bumper-lib.git fetched at 2019-Jul-01 20:29:43
#300 removed
#400 build 0.1.13-alt1 from /people/lav/packages/bumper.git fetched at 2019-Jul-01 09:36:50
2019-Jul-01 20:29:59 :: created build repo
2019-Jul-01 20:30:01 :: [x86_64] #240 python-module-bumper-lib.git 2.0.4-alt1: build start
2019-Jul-01 20:30:01 :: [aarch64] #240 python-module-bumper-lib.git 2.0.4-alt1: build start
2019-Jul-01 20:30:01 :: [i586] #240 python-module-bumper-lib.git 2.0.4-alt1: build start
    raise DistutilsError(msg)
distutils.errors.DistutilsError: Could not find suitable distribution for Requirement.parse('setuptools-git')
2019-Jul-01 20:31:09 :: [i586] python-module-bumper-lib.git 2.0.4-alt1: remote: build failed
2019-Jul-01 20:31:09 :: [i586] #240 python-module-bumper-lib.git 2.0.4-alt1: build FAILED
2019-Jul-01 20:31:09 :: [i586] requesting cancellation of task processing
    raise DistutilsError(msg)
distutils.errors.DistutilsError: Could not find suitable distribution for Requirement.parse('setuptools-git')
2019-Jul-01 20:31:12 :: [x86_64] python-module-bumper-lib.git 2.0.4-alt1: remote: build failed
2019-Jul-01 20:31:12 :: [x86_64] #240 python-module-bumper-lib.git 2.0.4-alt1: build FAILED
    raise DistutilsError(msg)
distutils.errors.DistutilsError: Could not find suitable distribution for Requirement.parse('setuptools-git')
2019-Jul-01 20:32:31 :: [aarch64] python-module-bumper-lib.git 2.0.4-alt1: remote: build failed
2019-Jul-01 20:32:31 :: [aarch64] #240 python-module-bumper-lib.git 2.0.4-alt1: build FAILED
2019-Jul-01 20:31:09 :: [i586] build FAILED
2019-Jul-01 20:31:12 :: [x86_64] build FAILED
2019-Jul-01 20:32:31 :: [aarch64] build FAILED
2019-Jul-01 20:32:31 :: task #233549 for sisyphus FAILED


More information about the Sisyphus-incominger mailing list