[cyber] I: Sisyphus-20230412 x86_64 beehive_status: +8 -6 (111)

ALT beekeeper hiver на altlinux.org
Ср Апр 12 07:39:07 MSK 2023

	8 NEW error logs

	checking for upc... no
	configure: error: no Unified Parallel C compiler was found
	+ exit_status=77
	+ exit 77
	2 of 878 tests failed
	(73 tests were not run)

	PASS: test-language
	error: interrupted by the user
	PASS: test-guild-compile
	PASS: test-pthread-create-secondary
	FAIL: SMOB mark function called for each SMOB
	FAIL: test-smob-mark
	PASS: test-smob-mark-race
	PASS: test-out-of-memory
	1 of 39 tests failed
	Please report to bug-guile на gnu.org

	received TERM, sending TERM to all workers:4111437
	hasher-privd: parent: handle_io: idle time limit (3600 seconds) exceeded

	tests/test_fast/test_proc.py::test_wrap PASSED				 [ 31%]
	tests/test_fast/test_proc.py::test_with FAILED				 [ 34%]
	tests/test_fast/test_proc.py::test_parse PASSED				 [ 36%]
	=========================== short test summary info ============================
	FAILED tests/test_fast/test_proc.py::test_with - assert False
	=================== 1 failed, 37 passed in 80.01s (0:01:20) ====================

	=========================== short test summary info ============================
	FAILED tests/test_it.py::test_myapp_reloads_when_touching_ini - RuntimeError:...
	=================== 1 failed, 4 passed, 1 warning in 13.63s ====================

	{3} oslo_middleware.tests.test_opts.TestOptionDiscovery.test_sizelimit [0.000469s] ... ok
	ERROR [oslo_middleware.basic_auth] Problem reading auth file: [Errno 2] No such file
	or directory: '/usr/src/tmp/tmpus2ghmiy/tmpsqs9hak5.missing'
	{2} oslo_middleware.tests.test_auth_basic.TestAuthBasic.test_authenticate [0.004398s]
	... ok
	self.wfile.flush() #actually send the response if not already done.
	ValueError: I/O operation on closed file.
	[0.013471s] ... ok
	{2} oslo_middleware.tests.test_healthcheck.HealthcheckMainTests.test_startup_response
	[0.524716s] ... ok
	{2} oslo_middleware.tests.test_healthcheck.HealthcheckTests.test_json_response [0.012054s]
	Captured traceback:
	raise mismatch_error
	testtools.matchers._impl.MismatchError: !=:
	reference = b'''\
	raise mismatch_error
	testtools.matchers._impl.MismatchError: !=:
	reference = b'''\

	result = pytester.runpytest("-n1")
	>	result.stdout.fnmatch_lines(["*RuntimeError: Some runtime error*"])
	E	Failed: nomatch: '*RuntimeError: Some runtime error*'
	E	    and: '============================= test session starts
	E	    and: 'INTERNALERROR>     raise IOError("cannot send to {!r}".format(self))'
	E	    and: 'INTERNALERROR> OSError: cannot send to <Channel id=1 closed>'
	E	    and: ''
	E	    and: '============================ no tests ran in 0.30s
	E	remains unmatched: '*RuntimeError: Some runtime error*'
	INTERNALERROR>	   raise IOError("cannot send to {!r}".format(self))
	INTERNALERROR> OSError: cannot send to <Channel id=1 closed>
	============================ no tests ran in 0.30s =============================
	XFAIL testing/test_workermanage.py::TestNodeManager::test_rsync_roots_no_roots - reason:
	FAILED testing/acceptance_test.py::test_internal_errors_propagate_to_controller
	======= 1 failed, 154 passed, 2 skipped, 10 xfailed in 61.14s (0:01:01) ========
	ERROR: InvocationError for command
	/usr/src/RPM/BUILD/python3-module-pytest-xdist-2.5.0/.tox/py3/bin/pytest (exited with
	code 1)
	py3 finish: run-test  after 61.46 seconds
	___________________________________ summary ____________________________________
	ERROR:	 py3: commands failed

	[ERROR] Please refer to /usr/src/RPM/BUILD/stringtemplate4-4.3.3/target/surefire-reports
	for the individual test results.
	[ERROR] Please refer to dump files (if any exist) [date].dump, [date]-jvmRun[N].dump and
	[ERROR] -> [Help 1]
	[ERROR] To see the full stack trace of the errors, re-run Maven with the -e switch.
	[ERROR] Re-run Maven using the -X switch to enable full debug logging.
	[ERROR] For more information about the errors and possible solutions, please read the
	following articles:
	[ERROR] [Help 1] http://cwiki.apache.org/confluence/display/MAVEN/MojoFailureException

	6 error logs REMOVED from the list

Total 111 error logs.

Подробная информация о списке рассылки Sisyphus-cybertalk