[cyber] I: Sisyphus-20230411 x86_64 beehive_status: +4 -8 (109)
ALT beekeeper
hiver на altlinux.org
Вт Апр 11 06:50:52 MSK 2023
4 NEW error logs
apache-commons-pool2-2.4.2-alt4_7jpp11
[ERROR] org.apache.commons.pool2.impl.TestGenericKeyedObjectPool.testBorrowObjectFairness
Time elapsed: 2.555 s <<< FAILURE!
java.lang.AssertionError: Thread 4 failed: java.lang.Exception: Expected: 04 found: 05
at
org.apache.commons.pool2.impl.TestGenericKeyedObjectPool.testBorrowObjectFairness(TestGenericKeyedObjectPool.java:1115)
litmus-0.14.0-alt2.git.9fbc73d
checking for a BSD-compatible install... /bin/install -c
./configure: line 2846: syntax error near unexpected token `0,'
./configure: line 2846: `NE_REQUIRE_VERSIONS(0, 26 27 28 29 30 31 32)'
prometheus-simpleclient-java-0.12.0-alt1_4jpp11
[ERROR] io.prometheus.client.HistogramTest.testTimeWithExemplar Time elapsed: 0.032
s <<< FAILURE!
java.lang.AssertionError: expected:<0.02> but was:<0.021023745>
at io.prometheus.client.HistogramTest.assertExemplar(HistogramTest.java:302)
python3-module-zmq-24.0.1-alt1.1
zmq/backend/cython/socket.pyx:787: in zmq.backend.cython.socket.Socket.send
E zmq.error.ZMQError: Socket operation on non-socket
zmq/backend/cython/socket.pyx:138: ZMQError
--
zmq/backend/cython/socket.pyx:787: in zmq.backend.cython.socket.Socket.send
E zmq.error.ZMQError: Socket operation on non-socket
zmq/backend/cython/socket.pyx:138: ZMQError
--
zmq/backend/cython/socket.pyx:787: in zmq.backend.cython.socket.Socket.send
E zmq.error.ZMQError: Socket operation on non-socket
zmq/backend/cython/socket.pyx:138: ZMQError
--
zmq/backend/cython/socket.pyx:787: in zmq.backend.cython.socket.Socket.send
E zmq.error.ZMQError: Socket operation on non-socket
zmq/backend/cython/socket.pyx:138: ZMQError
--
=========================== short test summary info ============================
FAILED tests/test_log.py::TestPubLog::test_blank_root_topic - TimeoutError: T...
FAILED tests/test_log.py::TestPubLog::test_custom_debug_formatter - zmq.error...
FAILED tests/test_log.py::TestPubLog::test_custom_global_formatter - zmq.erro...
FAILED tests/test_log.py::TestPubLog::test_init_iface - zmq.error.ZMQError: S...
FAILED tests/test_log.py::TestPubLog::test_init_socket - zmq.error.ZMQError: ...
FAILED tests/test_log.py::TestPubLog::test_root_topic - zmq.error.ZMQError: S...
FAILED tests/test_log.py::TestPubLog::test_set_info_formatter_via_property - ...
8 error logs REMOVED from the list
automake_1.11-1.11.6-alt9
libzim-8.1.0-alt1
mailfromd-8.15-alt1
python3-module-Delorean-1.0.0-alt1
python3-module-easyprocess-1.1-alt1
python3-module-hupper-1.0-alt2
python3-module-pytest-xdist-2.5.0-alt1
python3-module-pythran-0.12.1-alt1
Total 109 error logs.
Подробная информация о списке рассылки Sisyphus-cybertalk