[cyber] I: Sisyphus-20181019 i586 beehive_status: +27 -37 (411)

ALT beekeeper hiver altlinux.org
19 15:21:56 MSK 2018


	27 NEW error logs

SNNS-4.3-alt1.1.1.1
	ar  rc	lib3d.a net_analyzer.o d3_xUtils.o d3_global.o d3_anageo.o d3_shade.o d3_lists.o
	d3_point.o d3_dither.o d3_zgraph.o d3_fonts.o d3_graph.o d3_draw.o d3_disp.o d3_move.o
	d3_zValue.o d3_setup.o d3_units.o d3_links.o d3_model.o d3_project.o d3_light.o
	d3_pannels.o d3_main.o bn_bignet.o bn_basics.o bn_art1.o bn_art2.o bn_artmap.o
	bn_TD_bignet.o bn_kohonen.o bn_assoz.o o_graph.o bn_JordElm.o ui_class.o bn_bighop.o
	ranlib	lib3d.a
	make[1]: Leaving directory '/usr/src/RPM/BUILD/SNNSv4.3/xgui/sources'
	make[1]: Entering directory '/usr/src/RPM/BUILD/SNNSv4.3/xgui/sources'
	i586-alt-linux-gcc  libxgui1.a libxgui2.a lib3d.a \
	-lXaw3d -lXmu -lXt -lXext -lSM -lICE  -lX11  \
	../../kernel/sources/libkernel.a ../../kernel/sources/libfunc.a -lm -lfl  -o xgui
	libxgui1.a(ui_controlP.o): In function `ui_rem_performPrunInit':
	/usr/src/RPM/BUILD/SNNSv4.3/xgui/sources/ui_controlP.c:1191: warning: the use of
	`tempnam' is dangerous, better use `mkstemp'
	make[1]: Leaving directory '/usr/src/RPM/BUILD/SNNSv4.3/xgui/sources'

apache2-mod_nss-1.0.17-alt3
	test_suite1[2]: /: SSL connection, fail to verify ...
	hasher-priv: master: idle time limit (3600 seconds) exceeded

archivemail-0.9.0-alt1
	................................................F..................................................
	FAIL: testJustOld (__main__.TestIsTooOld)
	with max_days=1, should be true for these dates >= 1 day
	--
	Ran 99 tests in 2.213s
	FAILED (failures=1)

at-spi2-core-2.30.0-alt1
	[43/53] Generating Atspi-2.0.gir with a custom command.
	/usr/lib/gcc/i586-alt-linux/7/include/stddef.h:435: syntax error, unexpected identifier
	in '  __float128 __max_align_f128 __attribute__((__aligned__(__alignof(__float128))));'
	at '__float128'
	[44/53] Compiling C object
	'registryd/registryd@@at-spi2-registryd  exe/deviceeventcontroller.c.o'.
	--
	Building documentation for libatspi
	ERROR:
	Error in gtkdoc helper script:
	ERROR: 'gtkdoc-scangobj' failed with status 1
	libatspi-scan.c: In function ‘output_signals’:
	<command-line>:0:14: error: ‘dbind’ undeclared (first use in this function)
	/usr/include/glib-2.0/glib/gmessages.h:337:32: note: in expansion of macro
	‘G_LOG_DOMAIN’
	--
	libatspi-scan.c: In function ‘output_object_hierarchy’:
	<command-line>:0:14: error: ‘dbind’ undeclared (first use in this function)
	/usr/include/glib-2.0/glib/gmessages.h:337:32: note: in expansion of macro
	‘G_LOG_DOMAIN’
	--
	libatspi-scan.c: In function ‘output_object_interfaces’:
	<command-line>:0:14: error: ‘dbind’ undeclared (first use in this function)
	/usr/include/glib-2.0/glib/gmessages.h:337:32: note: in expansion of macro
	‘G_LOG_DOMAIN’
	--
	libatspi-scan.c: In function ‘output_interface_prerequisites’:
	<command-line>:0:14: error: ‘dbind’ undeclared (first use in this function)
	/usr/include/glib-2.0/glib/gmessages.h:337:32: note: in expansion of macro
	‘G_LOG_DOMAIN’
	--
	libatspi-scan.c: In function ‘output_args’:
	<command-line>:0:14: error: ‘dbind’ undeclared (first use in this function)
	/usr/include/glib-2.0/glib/gmessages.h:337:32: note: in expansion of macro
	‘G_LOG_DOMAIN’
	--
	Running custom install script '/usr/bin/meson --internal
	gtkdoc --sourcedir=/usr/src/RPM/BUILD/at-spi2-core-2.30.0
	--builddir=/usr/src/RPM/BUILD/at-spi2-core-2.30.0/i586-alt-linux --subdir=doc/libatspi
	--headerdirs=/usr/src/RPM/BUILD/at-spi2-core-2.30.0/atspi@@/usr/src/RPM/BUILD/at-spi2-core-2.30.0/i586-alt-linux/atspi
	--mainfile=libatspi-docs.sgml --modulename=libatspi --mode=auto --scanargs=--rebuild-types
	--gobjects-types-file=/usr/src/RPM/BUILD/at-spi2-core-2.30.0/doc/libatspi/libatspi.types
	--fixxrefargs=--html-dir=/usr/share/gtk-doc/html@@--extra-dir=/usr/share/gtk-doc/html/glib@@--extra-dir=/usr/share/gtk-doc/html/gobject
	--mkdbargs=--sgml-mode@@--output-format=xml --content-files= --cc=cc
	--ld=cc --cflags=-I/usr/src/RPM/BUILD/at-spi2-core-2.30.0/i586-alt-linux/.
	-I/usr/src/RPM/BUILD/at-spi2-core-2.30.0/. -I/usr/include/dbus-1.0
	-I/usr/lib/dbus-1.0/include -I/usr/include/glib-2.0 -I/usr/lib/glib-2.0/include
	-DG_LOG_DOMAIN="dbind" -pipe -frecord-gcc-switches -Wall -g -O2 -march=i586
	-mtune=generic --ldflags=-L/usr/src/RPM/BUILD/at-spi2-core-2.30.0/i586-alt-linux/atspi
	-Wl,-rpath,/usr/src/RPM/BUILD/at-spi2-core-2.30.0/i586-alt-linux/atspi -latspi -ldbus-1
	-lgobject-2.0 -lglib-2.0 -lX11 -lXtst -lXi -pipe -frecord-gcc-switches -Wall -g -O2
	-march=i586 -mtune=generic'
	FAILED: meson-install
	/usr/bin/meson install --no-rebuild

atlas-3.9.35-alt1.qa1
	/usr/src/RPM/BUILD/ATLAS/BUILD/..//include/atlas_mmpa
	hasher-priv: master: idle time limit (3600 seconds) exceeded

freecad-1:0.17-alt6
	-- /usr/src/RPM/BUILD/freecad-0.17/src/Gui/DocumentPy.cpp
	-- /usr/src/RPM/BUILD/freecad-0.17/src/Gui/PythonWorkbenchPy.cpp
	-- /usr/src/RPM/BUILD/freecad-0.17/src/Gui/ViewProviderPy.cpp
	-- /usr/src/RPM/BUILD/freecad-0.17/src/Gui/ViewProviderDocumentObjectPy.cpp
	-- /usr/src/RPM/BUILD/freecad-0.17/src/Gui/WorkbenchPy.cpp
	-- /usr/src/RPM/BUILD/freecad-0.17/src/Gui/SelectionObjectPy.cpp
	Now run 'make' to build FreeCAD
	-- Configuring incomplete, errors occurred!
	See also "/usr/src/RPM/BUILD/freecad-0.17/CMakeFiles/CMakeOutput.log".
	See also "/usr/src/RPM/BUILD/freecad-0.17/CMakeFiles/CMakeError.log".

glibc-6:2.27-alt6
	UNSUPPORTED: resolv/tst-resolv-threads
	FAIL: rt/tst-cpuclock2
	UNSUPPORTED: sunrpc/tst-svc_register
	--
	+ rc=2
	+ grep '^FAIL:' build-i586-linux/tests.sum
	+ xargs -i tail -v -n 100 'build-i586-linux/{}.test-result' 'build-i586-linux/{}.out'
	--
	==> build-i586-linux/rt/tst-cpuclock2.test-result <==
	FAIL: rt/tst-cpuclock2
	original exit status 1

guestfs-data-0.4-alt1
	+ cp -a '/usr/lib/guestfs/*' /usr/src/tmp/guestfs-data-buildroot/usr/lib/guestfs/
	cp: cannot stat '/usr/lib/guestfs/*': No such file or directory

hgview-1.10.2-alt1
	demandimport.ignore.append('roman')
	AttributeError: 'module' object has no attribute 'ignore'

intercal-0.29-alt1.git20140828.1
	groff -U -dc=y -Tascii -p -t -mm intercal.mm > intercal.refs.tmp
	intercal.mm:30: can't open `intercal.refs.qrf': No such file or directory
	intercal.mm:3115: warning: can't find special character `no'
	--
	mv tmp.refs intercal.refs.tmp
	mv: cannot stat 'tmp.refs': No such file or directory
	make: *** [Makefile:39: intercal.txt] Error 1
	--
	groff -U -dc=n -Tascii -p -t -mm intercal.mm > intercal.refs.tmp
	intercal.mm:30: can't open `intercal.refs.qrf': No such file or directory
	intercal.mm:3069: warning: can't find special character `no'
	--
	GROFF_NO_SGR=1 groff -U -dc=n -Tascii -p -t -mm intercal.mm >original.txt
	intercal.mm:30: can't open `intercal.refs.qrf': No such file or directory
	intercal.mm:3069: warning: can't find special character `no'
	--
	groff -U -dc=n -Tps    -p -t -mm intercal.mm >intercal.refs.tmp
	intercal.mm:30: can't open `intercal.refs.qrf': No such file or directory
	sed <intercal.refs.tmp -e '/hn \([0-9]*\)\.$/s//hn \1/' >tmp.refs;
	--
	groff -U -dc=n -Tps    -p -t -mm intercal.mm >original.ps
	intercal.mm:30: can't open `intercal.refs.qrf': No such file or directory
	rm -f intercal.refs.qrf intercal.refs.tmp
	--
	groff -U -dc=y -Tps    -p -t -mm intercal.mm >intercal.refs.tmp
	intercal.mm:30: can't open `intercal.refs.qrf': No such file or directory
	sed <intercal.refs.tmp -e '/hn \([0-9]*\)\.$/s//hn \1/' >tmp.refs;
	--
	groff -U -dc=y -Tps    -p -t -mm intercal.mm >intercal.ps
	intercal.mm:30: can't open `intercal.refs.qrf': No such file or directory
	rm -f intercal.refs.qrf intercal.refs.tmp

ipmiutil-3.1.3-alt1
	ipmi_sample.o: In function `main':
	/usr/src/RPM/BUILD/ipmiutil-3.1.3/util/ipmi_sample.c:121: undefined reference to `htoi'
	/usr/src/RPM/BUILD/ipmiutil-3.1.3/util/ipmi_sample.c:122: undefined reference to `htoi'
	/usr/src/RPM/BUILD/ipmiutil-3.1.3/util/ipmi_sample.c:123: undefined reference to `htoi'
	/usr/src/RPM/BUILD/ipmiutil-3.1.3/util/ipmi_sample.c:129: undefined reference to
	`ipmi_set_mc'
	/usr/src/RPM/BUILD/ipmiutil-3.1.3/util/ipmi_sample.c:150: undefined reference to
	`parse_lan_options'
	/usr/src/RPM/BUILD/ipmiutil-3.1.3/util/ipmi_sample.c:162: undefined reference to
	`print_lan_opt_usage'
	/usr/src/RPM/BUILD/ipmiutil-3.1.3/util/ipmi_sample.c:167: undefined reference to
	`get_BiosVersion'
	/usr/src/RPM/BUILD/ipmiutil-3.1.3/util/ipmi_sample.c:195: undefined reference to
	`parse_lan_options'
	/usr/src/RPM/BUILD/ipmiutil-3.1.3/util/ipmi_sample.c:198: undefined reference to
	`parse_lan_options'
	/usr/src/RPM/BUILD/ipmiutil-3.1.3/util/ipmi_sample.c:201: undefined reference to
	`ipmi_getdeviceid'

jed-2:0.99.19-alt2.qa2.1
	syntax.o: file not recognized: File truncated
	collect2: error: ld returned 1 exit status
	make[1]: *** [Makefile:188: /usr/src/RPM/BUILD/jed-0.99-19/src/objs/xjed] Error 1

jmock-0:2.8.2-alt2_5jpp8
	[ERROR] Tests run: 3, Failures: 0, Errors: 1, Skipped: 0, Time elapsed: 0.183 s <<<
	FAILURE! - in org.jmock.test.unit.lib.concurrent.BlitzerTests
	[ERROR]
	testActionsCanFailWithoutDeadlockingTheTestThread(org.jmock.test.unit.lib.concurrent.BlitzerTests)
	Time elapsed: 0.12 s  <<< ERROR!
	java.util.concurrent.TimeoutException: timed out waiting for blitzed actions to complete
	successfully

kde-icon-theme-DarkGlass_Reworked-2.72-alt2
	Ready to go!  Converting all icons! (about 10 minutes on an Athlon 64)
	hasher-priv: master: idle time limit (3600 seconds) exceeded

libbox2d-2.1.2-alt2
	/usr/src/RPM/BUILD/Box2D_v2.1.2/Box2D/Testbed/Framework/Main.cpp: In function 'int
	main(int, char**)':
	/usr/src/RPM/BUILD/Box2D_v2.1.2/Box2D/Testbed/Framework/Main.cpp:349:2: error:
	'glutMouseWheelFunc' was not declared in this scope
	glutMouseWheelFunc(MouseWheel);

libgdk-pixbuf-2.38.0-alt2
	OK:	   19
	FAIL:	    1
	SKIP:	    0
	--
	Full log written to
	/usr/src/RPM/BUILD/gdk-pixbuf-2.38.0/i586-alt-linux/meson-logs/testlog.txt
	FAILED: meson-test
	/usr/bin/meson test --no-rebuild --print-errorlogs

libosinfo-1.2.0-alt1.S1
	../build-aux/test-driver: line 107: 63931 Trace/breakpoint trap   "$@" > $log_file 2>&1
	FAIL: test-loader
	../build-aux/test-driver: line 107: 66353 Trace/breakpoint trap   "$@" > $log_file 2>&1
	FAIL: test-isodetect
	PASS: test-install-script
	../build-aux/test-driver: line 107: 67489 Trace/breakpoint trap   "$@" > $log_file 2>&1
	FAIL: test-os-resources
	SKIP: test-mediauris
	--
	# SKIP:  2
	# XFAIL: 0
	# FAIL:  3
	# XPASS: 0
	# ERROR: 0
	See tests/test-suite.log

lua-lpeg-1.0.1-alt2
	sh: lua: command not found
	error: line 21: Version required: BuildRequires: liblua5.3-devel >=
	hsh-rebuild: lua-lpeg-1.0.1-alt2.src.rpm: failed to fetch build dependencies.

maim-5.5.2-alt1
	-- Found PkgConfig: /usr/bin/pkg-config (found version "0.29.2")
	CMake Error at /usr/share/cmake/Modules/FindPackageHandleStandardArgs.cmake:137 (message):
	Could NOT find GLX (missing: GLX_INCLUDE_DIR)
	Call Stack (most recent call first):
	/usr/share/cmake/Modules/FindPackageHandleStandardArgs.cmake:378 (_FPHSA_FAILURE_MESSAGE)
	modules/FindGLX.cmake:36 (find_package_handle_standard_args)
	modules/FindSLOP.cmake:22 (FIND_PACKAGE)
	CMakeLists.txt:39 (find_package)
	-- Configuring incomplete, errors occurred!
	See also "/usr/src/RPM/BUILD/maim-5.5.2/CMakeFiles/CMakeOutput.log".

oddjob-0.34.4-alt1
	@@ -0,0 +1 @@
	+stat: cannot stat '/proc/1240/fd/3': No such file or directory
	FAIL

perl-IO-Event-0.813-alt2
	Result: FAIL
	Failed 1/12 test programs. 0/920 subtests failed.
	make: *** [Makefile:780: test_dynamic] Error 255

pspp-1.0.1-alt1
	## Test results. ##
	ERROR: 1161 tests were run,
	1 failed unexpectedly.

python-module-mpl_toolkits.basemap-1.1.0-alt1.1
	Errors from xkbcomp are not fatal to the X server
	Failure: TypeError ('<' not supported between instances of 'str' and 'int') ... ERROR
	ERROR: Failure: TypeError ('<' not supported between instances of 'str' and 'int')
	Traceback (most recent call last):
	--
	if self.version < other.version:
	TypeError: '<' not supported between instances of 'str' and 'int'
	Ran 1 test in 0.001s
	FAILED (errors=1)

python-module-pexpect-4.6-alt1
	/usr/src/RPM/BUILD/python3/tests/test_popen_spawn.py:113: DeprecationWarning: Please
	use assertRaisesRegex instead.
	with self.assertRaisesRegexp(TypeError, '.*must be one of'):
	/usr/src/RPM/BUILD/python3/tests/test_popen_spawn.py:115: DeprecationWarning: Please
	use assertRaisesRegex instead.
	with self.assertRaisesRegexp(TypeError, '.*must be one of'):
	/usr/src/RPM/BUILD/python3/tests/test_popen_spawn.py:117: DeprecationWarning: Please
	use assertRaisesRegex instead.
	with self.assertRaisesRegexp(TypeError, '.*must be one of'):
	/usr/src/RPM/BUILD/python3/tests/test_popen_spawn.py:119: DeprecationWarning: Please
	use assertRaisesRegex instead.
	with self.assertRaisesRegexp(TypeError, '.*must be one of'):
	-- Docs: https://docs.pytest.org/en/latest/warnings.html
	============= 2 failed, 217 passed, 11 warnings in 161.35 seconds ==============

python-module-sh-1.12.14-alt2
	test_pipe_fd (__main__.FunctionalTests) ... ok
	test_piped_exception1 (__main__.FunctionalTests) ... ERROR
	test_piped_exception2 (__main__.FunctionalTests) ... ERROR
	test_piped_generator (__main__.FunctionalTests) ... ok
	--
	test_unbuffered (__main__.StreamBuffererTests) ... ok
	ERROR: test_piped_exception1 (__main__.FunctionalTests)
	Traceback (most recent call last):
	--
	Exception ignored in: <_io.TextIOWrapper name='<stdout>' mode='w' encoding='UTF-8'>
	BrokenPipeError: [Errno 32] Broken pipe
	ERROR: test_piped_exception2 (__main__.FunctionalTests)
	Traceback (most recent call last):
	--
	Exception ignored in: <_io.TextIOWrapper name='<stdout>' mode='w' encoding='UTF-8'>
	BrokenPipeError: [Errno 32] Broken pipe
	Ran 156 tests in 81.715s
	FAILED (errors=2, skipped=1)
	Coverage.py warning: Module sh.py was never imported. (module-not-imported)

sgc-0.2.1-alt1
	pygame.display.init()
	error: Couldn't open X11 display
	The full traceback has been saved in /usr/src/tmp/sphinx-err-uSLCfL.log, if you want
	to report the issue to the developers.

systemd-1:239-alt2
	Build type: native build
	meson_options.txt:49:0: ERROR:	Option name debug is reserved.
	A full log can be found at
	/usr/src/RPM/BUILD/systemd-239/i586-alt-linux/meson-logs/meson-log.txt

	37 error logs REMOVED from the list
Cultivation-8-alt3.1
OpenSceneGraph-3.4.1-alt1
TORCS-1.3.0-alt7
Transcend-0.3-alt4.1
adanaxisgpl-1.2.5-alt4_28
apache2-mod_nss-1.0.17-alt2
crack-attack-1.1.14-alt9
cvs-1.11.23-alt6
gawk-4.1.0-alt2
gl-117-1.3.2-alt1.qa1
glaxium-0.5-alt6.1.qa4
golang-github-xtaci-smux-1.0.7-alt1_1
graphviz-2.40.1-alt4
gromacs-4.0.7-alt8
hdaps-gl-0.0.5-alt1.qa1
kiki-1.0.2-alt1.qa5
libgle-3.1.0-alt7.3.qa1
libguichan05-0.5.0-alt1_26
libtiff-4.0.3-alt1
lua-lpeg-1.0.1-alt1
lz4-1:1.8.3-alt1
mariadb-compat-10.1.36-alt1
mhgui-0.2-alt2.1
ocaml-lablgl-1.05-alt6
openni-1.5.7.10-alt2_13
perl-HTTP-Proxy-0.304-alt2
perl-PDL-2.19.0-alt1_1
pfstools-2.1.0-alt2
pyro-1.5-alt7
python-module-asynchttp-0.0.4-alt1.git20120701.1.1
python-module-matplotlib-2.0.0-alt7.1
razor-2.85-alt4.1.1.1
spl-0.7.11-alt1
srp-2.1.2-alt6.1
tardy-1.17-alt2.qa1
tcl-soap-1.6.8-alt0.2
vegastrike-0.5.1-alt7_31.r1.1

Total 411 error logs.


Sisyphus-cybertalk