[cyber] I: Sisyphus-20181019 x86_64 beehive_status: +17 -37 (403)

ALT beekeeper hiver altlinux.org
19 09:12:08 MSK 2018


	17 NEW error logs

at-spi2-core-2.30.0-alt1
	Building documentation for libatspi
	ERROR:
	Error in gtkdoc helper script:
	ERROR: 'gtkdoc-scangobj' failed with status 1
	libatspi-scan.c: In function ‘output_signals’:
	<command-line>:0:14: error: ‘dbind’ undeclared (first use in this function)
	/usr/include/glib-2.0/glib/gmessages.h:337:32: note: in expansion of macro
	‘G_LOG_DOMAIN’
	--
	libatspi-scan.c: In function ‘output_object_hierarchy’:
	<command-line>:0:14: error: ‘dbind’ undeclared (first use in this function)
	/usr/include/glib-2.0/glib/gmessages.h:337:32: note: in expansion of macro
	‘G_LOG_DOMAIN’
	--
	libatspi-scan.c: In function ‘output_object_interfaces’:
	<command-line>:0:14: error: ‘dbind’ undeclared (first use in this function)
	/usr/include/glib-2.0/glib/gmessages.h:337:32: note: in expansion of macro
	‘G_LOG_DOMAIN’
	--
	libatspi-scan.c: In function ‘output_interface_prerequisites’:
	<command-line>:0:14: error: ‘dbind’ undeclared (first use in this function)
	/usr/include/glib-2.0/glib/gmessages.h:337:32: note: in expansion of macro
	‘G_LOG_DOMAIN’
	--
	libatspi-scan.c: In function ‘output_args’:
	<command-line>:0:14: error: ‘dbind’ undeclared (first use in this function)
	/usr/include/glib-2.0/glib/gmessages.h:337:32: note: in expansion of macro
	‘G_LOG_DOMAIN’
	--
	Running custom install script '/usr/bin/meson --internal
	gtkdoc --sourcedir=/usr/src/RPM/BUILD/at-spi2-core-2.30.0
	--builddir=/usr/src/RPM/BUILD/at-spi2-core-2.30.0/x86_64-alt-linux --subdir=doc/libatspi
	--headerdirs=/usr/src/RPM/BUILD/at-spi2-core-2.30.0/atspi@@/usr/src/RPM/BUILD/at-spi2-core-2.30.0/x86_64-alt-linux/atspi
	--mainfile=libatspi-docs.sgml --modulename=libatspi --mode=auto --scanargs=--rebuild-types
	--gobjects-types-file=/usr/src/RPM/BUILD/at-spi2-core-2.30.0/doc/libatspi/libatspi.types
	--fixxrefargs=--html-dir=/usr/share/gtk-doc/html@@--extra-dir=/usr/share/gtk-doc/html/glib@@--extra-dir=/usr/share/gtk-doc/html/gobject
	--mkdbargs=--sgml-mode@@--output-format=xml --content-files= --cc=cc --ld=cc
	--cflags=-I/usr/src/RPM/BUILD/at-spi2-core-2.30.0/x86_64-alt-linux/.
	-I/usr/src/RPM/BUILD/at-spi2-core-2.30.0/. -I/usr/include/dbus-1.0
	-I/usr/lib64/dbus-1.0/include -I/usr/include/glib-2.0 -I/usr/lib64/glib-2.0/include
	-DG_LOG_DOMAIN="dbind" -pipe -frecord-gcc-switches -Wall -g -O2
	--ldflags=-L/usr/src/RPM/BUILD/at-spi2-core-2.30.0/x86_64-alt-linux/atspi
	-Wl,-rpath,/usr/src/RPM/BUILD/at-spi2-core-2.30.0/x86_64-alt-linux/atspi -latspi -ldbus-1
	-lgobject-2.0 -lglib-2.0 -lX11 -lXtst -lXi -pipe -frecord-gcc-switches -Wall -g -O2'
	FAILED: meson-install
	/usr/bin/meson install --no-rebuild

freecad-1:0.17-alt6
	-- /usr/src/RPM/BUILD/freecad-0.17/src/Gui/DocumentPy.cpp
	-- /usr/src/RPM/BUILD/freecad-0.17/src/Gui/PythonWorkbenchPy.cpp
	-- /usr/src/RPM/BUILD/freecad-0.17/src/Gui/ViewProviderPy.cpp
	-- /usr/src/RPM/BUILD/freecad-0.17/src/Gui/ViewProviderDocumentObjectPy.cpp
	-- /usr/src/RPM/BUILD/freecad-0.17/src/Gui/WorkbenchPy.cpp
	-- /usr/src/RPM/BUILD/freecad-0.17/src/Gui/SelectionObjectPy.cpp
	Now run 'make' to build FreeCAD
	-- Configuring incomplete, errors occurred!
	See also "/usr/src/RPM/BUILD/freecad-0.17/CMakeFiles/CMakeOutput.log".
	See also "/usr/src/RPM/BUILD/freecad-0.17/CMakeFiles/CMakeError.log".

gawk-4.1.0-alt2
	make[2]: Entering directory '/usr/src/RPM/BUILD/gawk-4.1.0-alt2/test'
	1 TESTS FAILED
	make[2]: *** [Makefile:3646: pass-fail] Error 1

hgview-1.10.2-alt1
	demandimport.ignore.append('roman')
	AttributeError: 'module' object has no attribute 'ignore'

libbox2d-2.1.2-alt2
	/usr/src/RPM/BUILD/Box2D_v2.1.2/Box2D/Testbed/Framework/Main.cpp: In function 'int
	main(int, char**)':
	/usr/src/RPM/BUILD/Box2D_v2.1.2/Box2D/Testbed/Framework/Main.cpp:349:2: error:
	'glutMouseWheelFunc' was not declared in this scope
	glutMouseWheelFunc(MouseWheel);

libosinfo-1.2.0-alt1.S1
	../build-aux/test-driver: line 107: 24420 Trace/breakpoint trap   "$@" > $log_file 2>&1
	FAIL: test-loader
	../build-aux/test-driver: line 107: 25238 Trace/breakpoint trap   "$@" > $log_file 2>&1
	FAIL: test-isodetect
	PASS: test-install-script
	../build-aux/test-driver: line 107: 25686 Trace/breakpoint trap   "$@" > $log_file 2>&1
	FAIL: test-os-resources
	SKIP: test-mediauris
	--
	# SKIP:  2
	# XFAIL: 0
	# FAIL:  3
	# XPASS: 0
	# ERROR: 0
	See tests/test-suite.log

libxfcegui4-4.10.0-alt5
	Running autoheader...
	autoheader-default: error: AC_CONFIG_HEADERS not found in configure.in

lua-lpeg-1.0.1-alt2
	sh: lua: command not found
	error: line 21: Version required: BuildRequires: liblua5.3-devel >=
	hsh-rebuild: lua-lpeg-1.0.1-alt2.src.rpm: failed to fetch build dependencies.

maim-5.5.2-alt1
	-- Found PkgConfig: /usr/bin/pkg-config (found version "0.29.2")
	CMake Error at /usr/share/cmake/Modules/FindPackageHandleStandardArgs.cmake:137 (message):
	Could NOT find GLX (missing: GLX_INCLUDE_DIR)
	Call Stack (most recent call first):
	/usr/share/cmake/Modules/FindPackageHandleStandardArgs.cmake:378 (_FPHSA_FAILURE_MESSAGE)
	modules/FindGLX.cmake:36 (find_package_handle_standard_args)
	modules/FindSLOP.cmake:22 (FIND_PACKAGE)
	CMakeLists.txt:39 (find_package)
	-- Configuring incomplete, errors occurred!
	See also "/usr/src/RPM/BUILD/maim-5.5.2/CMakeFiles/CMakeOutput.log".

opendx-4.4.4-alt7
	x86_64-alt-linux-gcc -E -I../../../include -I./../dpexec
	-I/usr/src/RPM/BUILD/opendx-4.4.4/include -Dlinux   -DHAVE_CONFIG_H -DCPLUSPLUS_UI
	-DEXECUTIVE_MODS tmp.c > dx.mdf
	cc1: fatal error: tmp.c: No such file or directory
	compilation terminated.

perl-IO-Event-0.813-alt2
	Result: FAIL
	Failed 1/12 test programs. 0/920 subtests failed.
	make: *** [Makefile:780: test_dynamic] Error 255

python-module-mpl_toolkits.basemap-1.1.0-alt1.1
	Errors from xkbcomp are not fatal to the X server
	Failure: TypeError ('<' not supported between instances of 'str' and 'int') ... ERROR
	ERROR: Failure: TypeError ('<' not supported between instances of 'str' and 'int')
	Traceback (most recent call last):
	--
	if self.version < other.version:
	TypeError: '<' not supported between instances of 'str' and 'int'
	Ran 1 test in 0.001s
	FAILED (errors=1)

quilt-0.65.0.27.0f2a-alt1
	make: Leaving directory '/usr/src/RPM/BUILD/quilt-0.65.0.27.0f2a-alt1'
	make: Entering directory '/usr/src/RPM/BUILD/quilt-0.65.0.27.0f2a-alt1'
	[three.test]
	66 commands (66 passed, 0 failed)
	make: Leaving directory '/usr/src/RPM/BUILD/quilt-0.65.0.27.0f2a-alt1'
	make: Entering directory '/usr/src/RPM/BUILD/quilt-0.65.0.27.0f2a-alt1'
	[two.test]
	57 commands (57 passed, 0 failed)
	make: Leaving directory '/usr/src/RPM/BUILD/quilt-0.65.0.27.0f2a-alt1'
	make: Target 'check' not remade because of errors.

sdcv-0.5.2-alt1
	10/10 Test  #7: t_interactive ....................   Passed    5.02 sec
	90% tests passed, 1 tests failed out of 10
	Total Test time (real) =   5.03 sec
	The following tests FAILED:
	1 - t_list (Failed)

systemd-1:239-alt2
	Build type: native build
	meson_options.txt:49:0: ERROR:	Option name debug is reserved.
	A full log can be found at
	/usr/src/RPM/BUILD/systemd-239/x86_64-alt-linux/meson-logs/meson-log.txt

zfs-0.7.11-alt1
	+ /bin/tar -xf /usr/src/RPM/SOURCES/zfs-0.7.11.tar
	+ cd zfs-0.7.11
	+ /bin/chmod -c -Rf u+rwX,go-w .
	+ echo 'Patch #1 (zfs-0.7.9-import-by-disk-id.patch):'
	Patch #1 (zfs-0.7.9-import-by-disk-id.patch):
	+ /usr/bin/patch -p1
	patching file etc/systemd/system/zfs-import-scan.service.in
	+ sed -i 's|datarootdir|libdir|' lib/libzfs/Makefile.am
	+ tar -C .. --exclude .gitignore -cJf zfs-0.7.11.tar.xz .
	tar: ./zfs-0.7.11: file changed as we read it

zopfli-1.0.2-alt2
	tree.o: file not recognized: File truncated
	collect2: error: ld returned 1 exit status
	make: *** [Makefile:28: libzopfli] Error 1

	37 error logs REMOVED from the list
Cultivation-8-alt3.1
OpenSceneGraph-3.4.1-alt1
TORCS-1.3.0-alt7
Transcend-0.3-alt4.1
adanaxisgpl-1.2.5-alt4_28
apache2-mod_nss-1.0.17-alt2
archivemail-0.9.0-alt1
bitlbee-facebook-1.1.2-alt1.g553593d
crack-attack-1.1.14-alt9
gl-117-1.3.2-alt1.qa1
glaxium-0.5-alt6.1.qa4
graphviz-2.40.1-alt4
hdaps-gl-0.0.5-alt1.qa1
holotz-castle-1.3.14-alt2.qa1
intercal-0.29-alt1.git20140828.1
jed-2:0.99.19-alt2.qa2.1
kiki-1.0.2-alt1.qa5
libgle-3.1.0-alt7.3.qa1
libguichan05-0.5.0-alt1_26
libtiff-4.0.3-alt1
lua-lpeg-1.0.1-alt1
meschach-1.2-alt1.b.3
mhgui-0.2-alt2.1
ocaml-lablgl-1.05-alt6
openmotif-2.3.3-alt4.1
openni-1.5.7.10-alt2_13
perl-PDL-2.19.0-alt1_1
pfstools-2.1.0-alt2
pyro-1.5-alt7
python-module-matplotlib-2.0.0-alt7.1
python-module-pretend-1.0.8-alt1.S1
python-module-scikits.fitting-1:0.6-alt2
sgc-0.2.1-alt1
spl-0.7.11-alt1
srp-2.1.2-alt6.1
tcl-soap-1.6.8-alt0.2
vegastrike-0.5.1-alt7_31.r1.1

Total 403 error logs.


Sisyphus-cybertalk