[cyber] I: Sisyphus-20131205 i586 beehive_status: +5 -9 (126)
ALT beekeeper
hiver на altlinux.org
Чт Дек 5 17:19:28 MSK 2013
5 NEW error logs
bouncycastle-pg-1.46-alt3_8jpp7
[junit] Testcase: testClearSignedBogusInput took 0.074 sec
[junit] Caused an ERROR
[junit] secret.bpg (No such file or directory)
[junit] java.io.FileNotFoundException: secret.bpg (No such file or directory)
[junit] at java.io.FileInputStream.open(Native Method)
--
[junit]
[junit] Testcase:
testClearSignedBogusInput(org.bouncycastle.openpgp.examples.test.AllTests): Caused
an ERROR
[junit] secret.bpg (No such file or directory)
[junit] java.io.FileNotFoundException: secret.bpg (No such file or directory)
[junit] at java.io.FileInputStream.open(Native Method)
--
[junit]
BUILD FAILED
/usr/src/RPM/BUILD/bcpg-jdk16-146/build.xml:114: Test
org.bouncycastle.openpgp.examples.test.AllTests failed
dolfin-complex-1:1.2.0-alt4.git20131022
+ mv dolfin-convert.1.gz dolfin-convert-complex.1.gz
+ mv dolfin-order.1.gz dolfin-order-complex.1.gz
+ popd
~/RPM/BUILD/dolfin-complex-1.2.0
+ cp /usr/include/ufc.h
/usr/src/tmp/dolfin-complex-buildroot/usr/lib/petsc-complex/include/dolfin/
+ cp /usr/include/swig/ufc.i
/usr/src/tmp/dolfin-complex-buildroot/usr/lib/petsc-complex/include/dolfin/swig/
cp: cannot create regular file
'/usr/src/tmp/dolfin-complex-buildroot/usr/lib/petsc-complex/include/dolfin/swig/':
Not a directory
error: Bad exit status from /usr/src/tmp/rpm-tmp.98058 (%install)
RPM build errors:
Macro %VERSION not found
dolfin-real-1:1.2.0-alt4.git20131022
+ mv /usr/src/tmp/dolfin-real-buildroot/usr/lib/petsc-real/bin/dolfin-convert
/usr/src/tmp/dolfin-real-buildroot/usr/lib/petsc-real/bin/dolfin-get-demos
/usr/src/tmp/dolfin-real-buildroot/usr/lib/petsc-real/bin/dolfin-order
/usr/src/tmp/dolfin-real-buildroot/usr/lib/petsc-real/bin/dolfin-plot
/usr/src/tmp/dolfin-real-buildroot/usr/lib/petsc-real/bin/dolfin-version
/usr/src/tmp/dolfin-real-buildroot/usr/bin/
+ rmdir /usr/src/tmp/dolfin-real-buildroot/usr/lib/petsc-real/bin
+ mv /usr/src/tmp/dolfin-real-buildroot/usr/lib/petsc-real/share/man
/usr/src/tmp/dolfin-real-buildroot/usr/share/
+ rm -fR /usr/src/tmp/dolfin-real-buildroot/usr/lib/petsc-real/share/man
+ cp /usr/include/ufc.h
/usr/src/tmp/dolfin-real-buildroot/usr/lib/petsc-real/include/dolfin/
+ cp /usr/include/swig/ufc.i
/usr/src/tmp/dolfin-real-buildroot/usr/lib/petsc-real/include/dolfin/swig/
cp: cannot create regular file
'/usr/src/tmp/dolfin-real-buildroot/usr/lib/petsc-real/include/dolfin/swig/': Not
a directory
error: Bad exit status from /usr/src/tmp/rpm-tmp.11087 (%install)
RPM build errors:
Macro %VERSION not found
python-module-migrate-0.7.2-alt1
...............EE............................EE......................
ERROR: Failure: ImportError (cannot import name exceptions)
Traceback (most recent call last):
--
from sqlalchemy import exceptions as sa_exceptions
ImportError: cannot import name exceptions
ERROR: Failure: ImportError (cannot import name exceptions)
Traceback (most recent call last):
--
from sqlalchemy import exceptions as sa_exceptions
ImportError: cannot import name exceptions
ERROR: Failure: ImportError (cannot import name exceptions)
Traceback (most recent call last):
--
from sqlalchemy import exceptions as sa_exceptions
ImportError: cannot import name exceptions
ERROR: Failure: ImportError (cannot import name exceptions)
Traceback (most recent call last):
--
from sqlalchemy import exceptions as sa_exceptions
ImportError: cannot import name exceptions
ERROR: Failure: ImportError (cannot import name exceptions)
Traceback (most recent call last):
--
from sqlalchemy import exceptions as sa_exceptions
ImportError: cannot import name exceptions
Ran 115 tests in 5.405s
shrinkwrap-1.0.0-alt1_2jpp7
Running org.jboss.shrinkwrap.impl.base.exporter.TarGzExporterTestCase
hasher-priv: master: idle time limit (3600 seconds) exceeded
9 error logs REMOVED from the list
frescobaldi-1.0.2-alt1.2
gcc4.4-4.4.7-alt2
kde3-kdiff3-0.9.92-alt2
kde4-python-4.11.2-alt1
kdeaddons-3.5.13.2-alt2
kernel-modules-nvidia-un-def-319.72-alt1.199433.1
perl-Graph-ReadWrite-2.04-alt1
python-module-zmq-2.2.0.1-alt2
qzion-0.4.0-alt6.1
Total 126 error logs.
Подробная информация о списке рассылки Sisyphus-cybertalk