[riscv-reports] [#124778] sisyphus_riscv64 FAILED (try 2) python3-module-hypothesis.git=6.152.4-alt0.port ...
Girar sisyphus_riscv64 awaiter recycler
noreply at basealt.ru
Wed May 13 09:22:22 MSK 2026
http://web.build.srt.basealt.ru/tasks/124778/logs/events.2.1.log
subtask name riscv64
#40 python3-module-hypothesis 8:17
#200 python3-module-pydantic-core 20:21
#300 python3-module-pydantic 4:58
2026-May-13 05:45:31 :: shared task #124778 for sisyphus_riscv64 resumed by recycler:
2026-May-13 05:45:31 :: message: sync
#40 build 6.152.4-alt0.port from /people/iv/packages/python3-module-hypothesis.git fetched at 2026-May-13 05:42:11
#100 removed
#200 build python3-module-pydantic-core-2.46.4-alt1.src.rpm
#300 build python3-module-pydantic-2.13.4-alt1.src.rpm
2026-May-13 05:45:32 :: created build repo
2026-May-13 05:45:42 :: [riscv64] #40 python3-module-hypothesis.git 6.152.4-alt0.port: build start
2026-May-13 05:53:59 :: [riscv64] #40 python3-module-hypothesis.git 6.152.4-alt0.port: build OK
2026-May-13 05:53:59 :: [riscv64] #200 python3-module-pydantic-core-2.46.4-alt1.src.rpm: build start
2026-May-13 06:14:20 :: [riscv64] #200 python3-module-pydantic-core-2.46.4-alt1.src.rpm: build OK
2026-May-13 06:14:20 :: [riscv64] #300 python3-module-pydantic-2.13.4-alt1.src.rpm: build start
2026-May-13 06:19:18 :: [riscv64] #300 python3-module-pydantic-2.13.4-alt1.src.rpm: build OK
2026-May-13 06:19:18 :: 40: build check OK
2026-May-13 06:19:19 :: 200: build check OK
2026-May-13 06:19:19 :: 300: build check OK
2026-May-13 06:19:20 :: build check OK
2026-May-13 06:19:20 :: #40: python3-module-hypothesis.git 6.152.4-alt0.port: version check OK
2026-May-13 06:19:20 :: #200: python3-module-pydantic-core-2.46.4-alt1.src.rpm: version check OK
2026-May-13 06:19:20 :: #300: python3-module-pydantic-2.13.4-alt1.src.rpm: version check OK
2026-May-13 06:19:20 :: build version check OK
2026-May-13 06:19:21 :: noarch check OK
2026-May-13 06:19:21 :: plan: src +3 -3 =20952, noarch +2 -2 =21801, riscv64 +2 -2 =37018
#40 python3-module-hypothesis 6.151.14-alt0.port -> 6.152.4-alt0.port
Wed May 13 2026 Ivan A. Melnikov <iv at altlinux.org> 6.152.4-alt0.port
- Increase too slow health check timeouts.
Fri May 08 2026 Alexandr Shashkin <dutyrok at altlinux.org> 6.152.4-alt1
- Updated to 6.152.4.
Tue Apr 21 2026 Alexandr Shashkin <dutyrok at altlinux.org> 6.152.1-alt1
- Updated to 6.152.1.
#300 python3-module-pydantic 2.13.1-alt1 -> 2.13.4-alt1
Fri May 08 2026 Alexandr Shashkin <dutyrok at altlinux.org> 2.13.4-alt1
- Updated to 2.13.4.
Tue Apr 21 2026 Alexandr Shashkin <dutyrok at altlinux.org> 2.13.3-alt1
- Updated to 2.13.3.
#200 python3-module-pydantic-core 2.46.1-alt1 -> 2.46.4-alt1
Fri May 08 2026 Alexandr Shashkin <dutyrok at altlinux.org> 2.46.4-alt1
- Updated to 2.46.4.
Tue Apr 21 2026 Alexandr Shashkin <dutyrok at altlinux.org> 2.46.3-alt1
- Updated to 2.46.3.
2026-May-13 06:19:46 :: patched apt indices
2026-May-13 06:19:48 :: created next repo
2026-May-13 06:19:58 :: duplicate provides check OK
2026-May-13 06:20:22 :: dependencies check OK
2026-May-13 06:20:43 :: [riscv64] ELF symbols check OK
2026-May-13 06:21:03 :: [riscv64.0] #40 python3-module-hypothesis: install check start
2026-May-13 06:21:04 :: [riscv64.1] #300 python3-module-pydantic: install check start
2026-May-13 06:21:04 :: [riscv64.2] #200 python3-module-pydantic-core: install check start
2026-May-13 06:22:17 :: [riscv64.0] #40 python3-module-hypothesis: install check OK
2026-May-13 06:22:18 :: [riscv64.1] #300 python3-module-pydantic: install check OK
2026-May-13 06:22:18 :: [riscv64.2] #200 python3-module-pydantic-core: install check OK
error: #40: python3-module-hypothesis.git tag `6.152.4-alt0.port' is not inherited from /gears/p/python3-module-hypothesis.git branch `sisyphus_riscv64'
2026-May-13 06:22:22 :: gears inheritance check FAILED for: #40
2026-May-13 06:22:22 :: task #124778 for sisyphus_riscv64 FAILED
More information about the Riscv-reports
mailing list