[riscv-reports] [#124778] sisyphus_riscv64 FAILED srpm=python3-module-hypothesis-6.152.4-alt1.src.rpm ...
Girar sisyphus_riscv64 awaiter recycler
noreply at basealt.ru
Wed May 13 05:22:26 MSK 2026
http://web.build.srt.basealt.ru/tasks/124778/logs/events.1.1.log
subtask name riscv64
#100 python3-module-hypothesis 9:30
#200 python3-module-pydantic-core 19:28
#300 python3-module-pydantic 4:49
2026-May-13 01:44:35 :: shared task #124778 for sisyphus_riscv64 started by recycler:
2026-May-13 01:44:35 :: message: sync
#100 build python3-module-hypothesis-6.152.4-alt1.src.rpm
#200 build python3-module-pydantic-core-2.46.4-alt1.src.rpm
#300 build python3-module-pydantic-2.13.4-alt1.src.rpm
2026-May-13 01:44:36 :: created build repo
2026-May-13 01:44:41 :: [riscv64] #100 python3-module-hypothesis-6.152.4-alt1.src.rpm: build start
2026-May-13 01:54:11 :: [riscv64] #100 python3-module-hypothesis-6.152.4-alt1.src.rpm: build OK
2026-May-13 01:54:11 :: [riscv64] #200 python3-module-pydantic-core-2.46.4-alt1.src.rpm: build start
2026-May-13 02:13:39 :: [riscv64] #200 python3-module-pydantic-core-2.46.4-alt1.src.rpm: build OK
2026-May-13 02:13:39 :: [riscv64] #300 python3-module-pydantic-2.13.4-alt1.src.rpm: build start
2026-May-13 02:18:28 :: [riscv64] #300 python3-module-pydantic-2.13.4-alt1.src.rpm: build OK
2026-May-13 02:18:29 :: 100: build check OK
2026-May-13 02:18:30 :: 200: build check OK
2026-May-13 02:18:30 :: 300: build check OK
2026-May-13 02:18:30 :: build check OK
2026-May-13 02:18:31 :: #100: python3-module-hypothesis-6.152.4-alt1.src.rpm: version check OK
2026-May-13 02:18:31 :: #200: python3-module-pydantic-core-2.46.4-alt1.src.rpm: version check OK
2026-May-13 02:18:31 :: #300: python3-module-pydantic-2.13.4-alt1.src.rpm: version check OK
2026-May-13 02:18:31 :: build version check OK
2026-May-13 02:18:31 :: noarch check OK
2026-May-13 02:18:32 :: plan: src +3 -3 =20949, noarch +2 -2 =21802, riscv64 +2 -2 =37007
#100 python3-module-hypothesis 6.151.14-alt0.port -> 6.152.4-alt1
Fri May 08 2026 Alexandr Shashkin <dutyrok at altlinux.org> 6.152.4-alt1
- Updated to 6.152.4.
Tue Apr 21 2026 Alexandr Shashkin <dutyrok at altlinux.org> 6.152.1-alt1
- Updated to 6.152.1.
#300 python3-module-pydantic 2.13.1-alt1 -> 2.13.4-alt1
Fri May 08 2026 Alexandr Shashkin <dutyrok at altlinux.org> 2.13.4-alt1
- Updated to 2.13.4.
Tue Apr 21 2026 Alexandr Shashkin <dutyrok at altlinux.org> 2.13.3-alt1
- Updated to 2.13.3.
#200 python3-module-pydantic-core 2.46.1-alt1 -> 2.46.4-alt1
Fri May 08 2026 Alexandr Shashkin <dutyrok at altlinux.org> 2.46.4-alt1
- Updated to 2.46.4.
Tue Apr 21 2026 Alexandr Shashkin <dutyrok at altlinux.org> 2.46.3-alt1
- Updated to 2.46.3.
2026-May-13 02:18:57 :: patched apt indices
2026-May-13 02:19:00 :: created next repo
2026-May-13 02:19:10 :: duplicate provides check OK
2026-May-13 02:19:34 :: dependencies check OK
2026-May-13 02:19:57 :: [riscv64] ELF symbols check OK
2026-May-13 02:20:17 :: [riscv64.0] #100 python3-module-hypothesis: install check start
2026-May-13 02:20:17 :: [riscv64.1] #300 python3-module-pydantic: install check start
2026-May-13 02:20:17 :: [riscv64.2] #200 python3-module-pydantic-core: install check start
2026-May-13 02:21:29 :: [riscv64.0] #100 python3-module-hypothesis: install check OK
2026-May-13 02:21:31 :: [riscv64.2] #200 python3-module-pydantic-core: install check OK
2026-May-13 02:21:32 :: [riscv64.1] #300 python3-module-pydantic: install check OK
error: #100: /gears/p/python3-module-hypothesis.git branch `sisyphus_riscv64' already exists, package update by srpm upload is not possible
2026-May-13 02:22:26 :: gears inheritance check FAILED for: #100
2026-May-13 02:22:26 :: task #124778 for sisyphus_riscv64 FAILED
More information about the Riscv-reports
mailing list