[riscv-reports] [#129985] sisyphus_riscv64 FAILED (try 2) srpm=telegram-desktop-6.9.3-alt1.src.rpm
Girar sisyphus_riscv64 awaiter recycler
noreply at basealt.ru
Thu Jun 25 13:17:58 MSK 2026
http://web.build.srt.basealt.ru/tasks/129985/logs/events.2.1.log
subtask name riscv64
#100 telegram-desktop failed
2026-Jun-25 10:07:48 :: shared task #129985 for sisyphus_riscv64 resumed by recycler:
2026-Jun-25 10:07:48 :: message: sync
#100 build telegram-desktop-6.9.3-alt1.src.rpm
2026-Jun-25 10:08:02 :: [riscv64] #100 telegram-desktop-6.9.3-alt1.src.rpm: build start
[riscv64] /usr/bin/ranlib libexternal_microtex_bundled.a
[riscv64] gmake[2]: Leaving directory '/usr/src/RPM/BUILD/telegram-desktop-6.9.3/riscv64-alt-linux'
[riscv64] gmake[1]: Entering directory '/usr/src/RPM/BUILD/telegram-desktop-6.9.3/riscv64-alt-linux'
[riscv64] [ 5%] Built target external_microtex_bundled
[riscv64] gmake[1]: Leaving directory '/usr/src/RPM/BUILD/telegram-desktop-6.9.3/riscv64-alt-linux'
[riscv64] gmake: *** [Makefile:136: all] Error 2
[riscv64] error: Bad exit status from /usr/src/tmp/rpmb-tmp.Hi9MUc (%build)
[riscv64] RPM build errors:
[riscv64] Macro %_Kservices not found
[riscv64] Bad exit status from /usr/src/tmp/rpmb-tmp.Hi9MUc (%build)
2026-Jun-25 10:17:57 :: [riscv64] telegram-desktop-6.9.3-alt1.src.rpm: remote: build failed
2026-Jun-25 10:17:57 :: [riscv64] #100 telegram-desktop-6.9.3-alt1.src.rpm: build FAILED
2026-Jun-25 10:17:57 :: [riscv64] requesting cancellation of task processing
2026-Jun-25 10:17:58 :: [riscv64] build FAILED
2026-Jun-25 10:17:58 :: task #129985 for sisyphus_riscv64 FAILED
More information about the Riscv-reports
mailing list