[riscv-reports] [#129985] sisyphus_riscv64 FAILED srpm=telegram-desktop-6.9.3-alt1.src.rpm
Girar sisyphus_riscv64 awaiter recycler
noreply at basealt.ru
Wed Jun 24 18:55:57 MSK 2026
http://web.build.srt.basealt.ru/tasks/129985/logs/events.1.1.log
subtask name riscv64
#100 telegram-desktop failed
2026-Jun-24 15:45:41 :: shared task #129985 for sisyphus_riscv64 started by recycler:
2026-Jun-24 15:45:41 :: message: sync
#100 build telegram-desktop-6.9.3-alt1.src.rpm
2026-Jun-24 15:45:47 :: [riscv64] #100 telegram-desktop-6.9.3-alt1.src.rpm: build start
[riscv64] /usr/bin/ranlib libexternal_microtex_bundled.a
[riscv64] gmake[2]: Leaving directory '/usr/src/RPM/BUILD/telegram-desktop-6.9.3/riscv64-alt-linux'
[riscv64] gmake[1]: Entering directory '/usr/src/RPM/BUILD/telegram-desktop-6.9.3/riscv64-alt-linux'
[riscv64] [ 5%] Built target external_microtex_bundled
[riscv64] gmake[1]: Leaving directory '/usr/src/RPM/BUILD/telegram-desktop-6.9.3/riscv64-alt-linux'
[riscv64] gmake: *** [Makefile:136: all] Error 2
[riscv64] error: Bad exit status from /usr/src/tmp/rpmb-tmp.lIFiql (%build)
[riscv64] RPM build errors:
[riscv64] Macro %_Kservices not found
[riscv64] Bad exit status from /usr/src/tmp/rpmb-tmp.lIFiql (%build)
2026-Jun-24 15:55:56 :: [riscv64] telegram-desktop-6.9.3-alt1.src.rpm: remote: build failed
2026-Jun-24 15:55:56 :: [riscv64] #100 telegram-desktop-6.9.3-alt1.src.rpm: build FAILED
2026-Jun-24 15:55:56 :: [riscv64] requesting cancellation of task processing
2026-Jun-24 15:55:57 :: [riscv64] build FAILED
2026-Jun-24 15:55:57 :: task #129985 for sisyphus_riscv64 FAILED
More information about the Riscv-reports
mailing list