[riscv-reports] [#129750] sisyphus_riscv64 FAILED (try 2) srpm=libopenimageio-3.1.14.1-alt1.src.rpm
Girar sisyphus_riscv64 awaiter recycler
noreply at basealt.ru
Wed Jun 24 10:07:20 MSK 2026
http://web.build.srt.basealt.ru/tasks/129750/logs/events.2.1.log
subtask name riscv64
#100 libopenimageio failed
2026-Jun-24 06:32:13 :: shared task #129750 for sisyphus_riscv64 resumed by recycler:
2026-Jun-24 06:32:13 :: message: sync
#100 build libopenimageio-3.1.14.1-alt1.src.rpm
2026-Jun-24 06:32:18 :: [riscv64] #100 libopenimageio-3.1.14.1-alt1.src.rpm: build start
[riscv64] Total time: 4m 49.7s
[riscv64] ERRORS!
[riscv64] 143/143 Test #118: unit_atomic ............................. Passed 944.50 sec
[riscv64] 99% tests passed, 2 tests failed out of 143
[riscv64] Total Test time (real) = 976.87 sec
[riscv64] The following tests FAILED:
[riscv64] 23 - maketx (Failed)
2026-Jun-24 07:07:19 :: [riscv64] libopenimageio-3.1.14.1-alt1.src.rpm: remote: build failed
2026-Jun-24 07:07:19 :: [riscv64] #100 libopenimageio-3.1.14.1-alt1.src.rpm: build FAILED
2026-Jun-24 07:07:19 :: [riscv64] requesting cancellation of task processing
2026-Jun-24 07:07:19 :: [riscv64] build FAILED
2026-Jun-24 07:07:19 :: task #129750 for sisyphus_riscv64 FAILED
More information about the Riscv-reports
mailing list