[riscv-reports] [#129750] sisyphus_riscv64 FAILED srpm=libopenimageio-3.1.14.1-alt1.src.rpm
Girar sisyphus_riscv64 awaiter recycler
noreply at basealt.ru
Wed Jun 24 00:41:53 MSK 2026
http://web.build.srt.basealt.ru/tasks/129750/logs/events.1.1.log
subtask name riscv64
#100 libopenimageio failed
2026-Jun-23 21:06:38 :: shared task #129750 for sisyphus_riscv64 started by recycler:
2026-Jun-23 21:06:38 :: message: sync
#100 build libopenimageio-3.1.14.1-alt1.src.rpm
2026-Jun-23 21:06:45 :: [riscv64] #100 libopenimageio-3.1.14.1-alt1.src.rpm: build start
[riscv64] Total time: 4m 47.6s
[riscv64] ERRORS!
[riscv64] 142/143 Test #4: oiiotool ................................ Passed 332.60 sec
[riscv64] 143/143 Test #118: unit_atomic ............................. Passed 935.33 sec
[riscv64] 99% tests passed, 2 tests failed out of 143
[riscv64] Total Test time (real) = 969.09 sec
[riscv64] The following tests FAILED:
[riscv64] 23 - maketx (Failed)
2026-Jun-23 21:41:52 :: [riscv64] libopenimageio-3.1.14.1-alt1.src.rpm: remote: build failed
2026-Jun-23 21:41:52 :: [riscv64] #100 libopenimageio-3.1.14.1-alt1.src.rpm: build FAILED
2026-Jun-23 21:41:52 :: [riscv64] requesting cancellation of task processing
2026-Jun-23 21:41:53 :: [riscv64] build FAILED
2026-Jun-23 21:41:53 :: task #129750 for sisyphus_riscv64 FAILED
More information about the Riscv-reports
mailing list