[riscv-reports] [#131162] sisyphus_riscv64 FAILED (try 2) srpm=guile-fibers-1.4.3-alt1.src.rpm srpm=shepherd-1.0.9-alt1.src.rpm

Girar sisyphus_riscv64 awaiter recycler noreply at basealt.ru
Fri Jul 17 10:14:36 MSK 2026


http://web.build.srt.basealt.ru/tasks/131162/logs/events.2.1.log

subtask  name          riscv64
   #100  guile-fibers   failed

2026-Jul-16 07:41:04 :: shared task #131162 for sisyphus_riscv64 resumed by recycler:
2026-Jul-16 07:41:04 :: message: sync
#100 build guile-fibers-1.4.3-alt1.src.rpm
#200 build shepherd-1.0.9-alt1.src.rpm
2026-Jul-16 07:41:04 :: created build repo
2026-Jul-16 07:41:17 :: [riscv64] #100 guile-fibers-1.4.3-alt1.src.rpm: build start
[riscv64] assert (false-if-exception (begin (run-fibers) #t)) equal to #f: ok
[riscv64] assert (let ((before (thread-count))) (run-fibers (lambda () #t)) (= before (thread-count))) equal to #t: Backtrace:
[riscv64]            5 (primitive-load "/usr/src/RPM/BUILD/guile-fibers-1.4.3/./tests/basic.scm")
[riscv64] --
[riscv64] override/fibers/events-impl.scm:129:2: In procedure epoll-wake!:
[riscv64] Throw to key `match-error' with args `FAIL: tests/basic.scm
[riscv64] make[2]: *** [Makefile:1165: check-TESTS] Killed
2026-Jul-17 07:14:36 :: [riscv64] guile-fibers-1.4.3-alt1.src.rpm: remote: build failed
2026-Jul-17 07:14:36 :: [riscv64] #100 guile-fibers-1.4.3-alt1.src.rpm: build FAILED
2026-Jul-17 07:14:36 :: [riscv64] requesting cancellation of task processing
2026-Jul-17 07:14:36 :: [riscv64] build FAILED
2026-Jul-17 07:14:36 :: task #131162 for sisyphus_riscv64 FAILED


More information about the Riscv-reports mailing list