[riscv-reports] [#128627] sisyphus_riscv64 FAILED (try 4) srpm=glibc-2.43.0.35.fe0ccc-alt1.src.rpm
Girar sisyphus_riscv64 awaiter recycler
noreply at basealt.ru
Sat Jul 4 08:49:33 MSK 2026
http://web.build.srt.basealt.ru/tasks/128627/logs/events.4.1.log
2026-Jul-04 05:46:30 :: shared task #128627 for sisyphus_riscv64 resumed by recycler:
2026-Jul-04 05:46:30 :: message: sync
#100 build glibc-2.43.0.35.fe0ccc-alt1.src.rpm
#200 removed
#300 removed
2026-Jul-04 05:46:36 :: [riscv64] #100 glibc-2.43.0.35.fe0ccc-alt1.src.rpm: build start
2026-Jul-04 05:46:42 :: [riscv64] #100 glibc-2.43.0.35.fe0ccc-alt1.src.rpm: build swiftly SKIPPED
2026-Jul-04 05:46:42 :: 100: build check OK (cached)
2026-Jul-04 05:46:42 :: build check OK
2026-Jul-04 05:46:43 :: #100: glibc-2.43.0.35.fe0ccc-alt1.src.rpm: version check OK
2026-Jul-04 05:46:43 :: build version check OK
2026-Jul-04 05:46:43 :: noarch check OK
2026-Jul-04 05:46:44 :: plan: src +1 -1 =21204, noarch +3 -3 =21991, riscv64 +26 -26 =37536
#100 glibc 2.40.0.224.573a-alt1.0.port -> 6:2.43.0.35.fe0ccc-alt1
Tue Jun 09 2026 Gleb F-Malinovskiy <glebfm at altlinux.org> 6:2.43.0.35.fe0ccc-alt1
- glibc-2.40-224-g573a7e46ec -> glibc-2.43-35-gfe0ccc9564.
2026-Jul-04 05:47:11 :: patched apt indices
2026-Jul-04 05:47:14 :: created next repo
2026-Jul-04 05:47:24 :: duplicate provides check OK
2026-Jul-04 05:47:49 :: dependencies check OK
2026-Jul-04 05:48:11 :: [riscv64] ELF symbols check OK
2026-Jul-04 05:48:32 :: [riscv64.0] #100 glibc: install check start
2026-Jul-04 05:48:32 :: [riscv64.0] #100 glibc: install check swiftly skipped
2026-Jul-04 05:48:32 :: [riscv64.0] #100 glibc-core: install check start
2026-Jul-04 05:48:32 :: [riscv64.1] #100 glibc-debug: install check start
2026-Jul-04 05:48:32 :: [riscv64.1] #100 glibc-debug: install check swiftly skipped
2026-Jul-04 05:48:32 :: [riscv64.1] #100 glibc-devel: install check start
2026-Jul-04 05:48:32 :: [riscv64.1] #100 glibc-devel: install check swiftly skipped
2026-Jul-04 05:48:32 :: [riscv64.1] #100 glibc-devel-static: install check start
2026-Jul-04 05:48:32 :: [riscv64.1] #100 glibc-devel-static: install check swiftly skipped
2026-Jul-04 05:48:32 :: [riscv64.1] #100 glibc-doc: install check start
2026-Jul-04 05:48:32 :: [riscv64.1] #100 glibc-doc: install check swiftly skipped
2026-Jul-04 05:48:32 :: [riscv64.1] #100 glibc-gconv-modules: install check start
2026-Jul-04 05:48:32 :: [riscv64.1] #100 glibc-gconv-modules: install check swiftly skipped
2026-Jul-04 05:48:32 :: [riscv64.1] #100 glibc-i18ndata: install check start
2026-Jul-04 05:48:32 :: [riscv64.1] #100 glibc-i18ndata: install check swiftly skipped
2026-Jul-04 05:48:32 :: [riscv64.1] #100 glibc-locales: install check start
2026-Jul-04 05:48:32 :: [riscv64.1] #100 glibc-locales: install check swiftly skipped
2026-Jul-04 05:48:32 :: [riscv64.2] #100 glibc-nss: install check start
2026-Jul-04 05:48:32 :: [riscv64.2] #100 glibc-nss: install check swiftly skipped
2026-Jul-04 05:48:32 :: [riscv64.1] #100 glibc-preinstall: install check start
2026-Jul-04 05:48:32 :: [riscv64.2] #100 glibc-pthread: install check start
2026-Jul-04 05:48:32 :: [riscv64.2] #100 glibc-pthread: install check swiftly skipped
2026-Jul-04 05:48:32 :: [riscv64.2] #100 glibc-source: install check start
2026-Jul-04 05:48:32 :: [riscv64.2] #100 glibc-source: install check swiftly skipped
2026-Jul-04 05:48:32 :: [riscv64.2] #100 glibc-timezones: install check start
2026-Jul-04 05:48:32 :: [riscv64.2] #100 glibc-timezones: install check swiftly skipped
2026-Jul-04 05:48:32 :: [riscv64.2] #100 glibc-utils: install check start
2026-Jul-04 05:48:32 :: [riscv64.2] #100 glibc-utils: install check swiftly skipped
2026-Jul-04 05:48:32 :: [riscv64.2] #100 iconv: install check start
2026-Jul-04 05:48:32 :: [riscv64.2] #100 iconv: install check swiftly skipped
2026-Jul-04 05:48:32 :: [riscv64.2] #100 libnsl1: install check start
2026-Jul-04 05:48:32 :: [riscv64.2] #100 libnsl1: install check swiftly skipped
2026-Jul-04 05:48:32 :: [riscv64.3] #100 nscd: install check start
2026-Jul-04 05:48:32 :: [riscv64.3] #100 nscd: install check swiftly skipped
2026-Jul-04 05:49:29 :: [riscv64.0] #100 glibc-core: install check OK (basesystem)
2026-Jul-04 05:49:29 :: [riscv64.1] #100 glibc-preinstall: install check OK (basesystem)
error: #100: /gears/g/glibc.git branch `sisyphus_riscv64' already exists, package update by srpm upload is not possible
2026-Jul-04 05:49:33 :: gears inheritance check FAILED for: #100
2026-Jul-04 05:49:33 :: task #128627 for sisyphus_riscv64 FAILED
More information about the Riscv-reports
mailing list