[riscv-reports] [#131326] [test-only] sisyphus_riscv64 FAILED (try 2) srpm=libjxl-0.12.0-alt1.src.rpm srpm=libjxl0.11-0.11.2-alt2.src.rpm ...
Girar sisyphus_riscv64 awaiter iv
noreply at basealt.ru
Mon Jul 6 18:42:14 MSK 2026
http://web.build.srt.basealt.ru/tasks/131326/logs/events.2.1.log
subtask name riscv64
#600 libwebkitgtk6.0 failed
#700 darktable 22:35
#1000 rawtherapee 1:19:00
#1100 gthumb 9:10
#1200 fotocx 4:16
#1300 geeqie 7:40
2026-Jul-06 13:26:28 :: test-only shared task #131326 for sisyphus_riscv64 resumed by iv:
2026-Jul-06 13:26:28 :: message: sync
#100 build libjxl-0.12.0-alt1.src.rpm
#200 build libjxl0.11-0.11.2-alt2.src.rpm
#300 build glycin-1.2.3-alt1.src.rpm
#400 build glycin-2-2.1.5-alt1.src.rpm
#500 build efl-1.28.1-alt1.1.src.rpm
#600 build libwebkitgtk6.0-2.52.4-alt1.src.rpm
#700 build darktable-5.6.0-alt1.src.rpm
#1000 build rawtherapee-5.12-alt1.1.src.rpm
#1100 build gthumb-3.12.10-alt1.src.rpm
#1200 build fotocx-26.6-alt1.src.rpm
#1300 build geeqie-2.9-alt1.src.rpm
2026-Jul-06 13:26:28 :: created build repo
2026-Jul-06 13:26:33 :: [riscv64] #100 libjxl-0.12.0-alt1.src.rpm: build start
2026-Jul-06 13:26:39 :: [riscv64] #100 libjxl-0.12.0-alt1.src.rpm: build swiftly SKIPPED
2026-Jul-06 13:26:39 :: [riscv64] #200 libjxl0.11-0.11.2-alt2.src.rpm: build start
2026-Jul-06 13:26:45 :: [riscv64] #200 libjxl0.11-0.11.2-alt2.src.rpm: build swiftly SKIPPED
2026-Jul-06 13:26:45 :: [riscv64] #300 glycin-1.2.3-alt1.src.rpm: build start
2026-Jul-06 13:26:49 :: [riscv64] #300 glycin-1.2.3-alt1.src.rpm: build swiftly SKIPPED
2026-Jul-06 13:26:49 :: [riscv64] #400 glycin-2-2.1.5-alt1.src.rpm: build start
2026-Jul-06 13:26:52 :: [riscv64] #400 glycin-2-2.1.5-alt1.src.rpm: build swiftly SKIPPED
2026-Jul-06 13:26:53 :: [riscv64] #500 efl-1.28.1-alt1.1.src.rpm: build start
2026-Jul-06 13:27:02 :: [riscv64] #500 efl-1.28.1-alt1.1.src.rpm: build swiftly SKIPPED
2026-Jul-06 13:27:02 :: [riscv64] #600 libwebkitgtk6.0-2.52.4-alt1.src.rpm: build start
[riscv64] 4374 | static SType S() { return SType::v<SType, value>(); }
[riscv64] /usr/src/RPM/BUILD/webkitgtk-2.52.4/Source/JavaScriptCore/assembler/MacroAssemblerRISCV64.h:1110:58: error: no matching function for call to 'S'
[riscv64] 1110 | m_assembler.sbInsn(resolution.base, immRegister, Imm::S(resolution.offset));
[riscv64] --
[riscv64] 4374 | static SType S() { return SType::v<SType, value>(); }
[riscv64] /usr/src/RPM/BUILD/webkitgtk-2.52.4/Source/JavaScriptCore/assembler/MacroAssemblerRISCV64.h:1130:50: error: no matching function for call to 'S'
[riscv64] 1130 | m_assembler.shInsn(resolution.base, src, Imm::S(resolution.offset));
[riscv64] --
[riscv64] 4374 | static SType S() { return SType::v<SType, value>(); }
[riscv64] /usr/src/RPM/BUILD/webkitgtk-2.52.4/Source/JavaScriptCore/assembler/MacroAssemblerRISCV64.h:1136:50: error: no matching function for call to 'S'
[riscv64] 1136 | m_assembler.shInsn(resolution.base, src, Imm::S(resolution.offset));
[riscv64] --
[riscv64] 4374 | static SType S() { return SType::v<SType, value>(); }
[riscv64] /usr/src/RPM/BUILD/webkitgtk-2.52.4/Source/JavaScriptCore/assembler/MacroAssemblerRISCV64.h:1157:58: error: no matching function for call to 'S'
[riscv64] 1157 | m_assembler.shInsn(resolution.base, immRegister, Imm::S(resolution.offset));
[riscv64] --
[riscv64] 4374 | static SType S() { return SType::v<SType, value>(); }
[riscv64] /usr/src/RPM/BUILD/webkitgtk-2.52.4/Source/JavaScriptCore/assembler/MacroAssemblerRISCV64.h:1171:58: error: no matching function for call to 'S'
[riscv64] 1171 | m_assembler.shInsn(resolution.base, immRegister, Imm::S(resolution.offset));
[riscv64] --
[riscv64] 4374 | static SType S() { return SType::v<SType, value>(); }
[riscv64] /usr/src/RPM/BUILD/webkitgtk-2.52.4/Source/JavaScriptCore/assembler/MacroAssemblerRISCV64.h:1191:50: error: no matching function for call to 'S'
[riscv64] 1191 | m_assembler.swInsn(resolution.base, src, Imm::S(resolution.offset));
[riscv64] --
[riscv64] 4374 | static SType S() { return SType::v<SType, value>(); }
[riscv64] /usr/src/RPM/BUILD/webkitgtk-2.52.4/Source/JavaScriptCore/assembler/MacroAssemblerRISCV64.h:1197:50: error: no matching function for call to 'S'
[riscv64] 1197 | m_assembler.swInsn(resolution.base, src, Imm::S(resolution.offset));
[riscv64] --
[riscv64] 4374 | static SType S() { return SType::v<SType, value>(); }
[riscv64] fatal error: too many errors emitted, stopping now [-ferror-limit=]
[riscv64] 20 errors generated.
2026-Jul-06 13:39:18 :: [riscv64] libwebkitgtk6.0-2.52.4-alt1.src.rpm: remote: build failed
2026-Jul-06 13:39:18 :: [riscv64] #600 libwebkitgtk6.0-2.52.4-alt1.src.rpm: build FAILED
2026-Jul-06 13:39:18 :: [riscv64] #600 libwebkitgtk6.0-2.52.4-alt1.src.rpm:: KEEP_GOING cheat activated, moving on
2026-Jul-06 13:39:19 :: [riscv64] #700 darktable-5.6.0-alt1.src.rpm: build start
2026-Jul-06 14:01:54 :: [riscv64] #700 darktable-5.6.0-alt1.src.rpm: build OK
2026-Jul-06 14:01:54 :: [riscv64] #1000 rawtherapee-5.12-alt1.1.src.rpm: build start
2026-Jul-06 15:20:54 :: [riscv64] #1000 rawtherapee-5.12-alt1.1.src.rpm: build OK
2026-Jul-06 15:20:54 :: [riscv64] #1100 gthumb-3.12.10-alt1.src.rpm: build start
2026-Jul-06 15:30:04 :: [riscv64] #1100 gthumb-3.12.10-alt1.src.rpm: build OK
2026-Jul-06 15:30:04 :: [riscv64] #1200 fotocx-26.6-alt1.src.rpm: build start
2026-Jul-06 15:34:20 :: [riscv64] #1200 fotocx-26.6-alt1.src.rpm: build OK
2026-Jul-06 15:34:20 :: [riscv64] #1300 geeqie-2.9-alt1.src.rpm: build start
2026-Jul-06 15:42:00 :: [riscv64] #1300 geeqie-2.9-alt1.src.rpm: build OK
2026-Jul-06 15:42:02 :: 100: build check OK
2026-Jul-06 15:42:03 :: 200: build check OK
2026-Jul-06 15:42:05 :: 300: build check OK
2026-Jul-06 15:42:07 :: 400: build check OK
2026-Jul-06 15:42:09 :: 500: build check OK
find: 'riscv64/srpm/': No such file or directory
2026-Jul-06 15:42:10 :: 700: build check OK
2026-Jul-06 15:42:11 :: 1000: build check OK
2026-Jul-06 15:42:12 :: 1100: build check OK
2026-Jul-06 15:42:13 :: 1200: build check OK
2026-Jul-06 15:42:13 :: 1300: build check OK
2026-Jul-06 15:42:14 :: build check FAILED for: #600
2026-Jul-06 15:42:14 :: task #131326 for sisyphus_riscv64 FAILED
More information about the Riscv-reports
mailing list