[riscv-reports] [#131326] sisyphus_riscv64 FAILED srpm=libjxl-0.12.0-alt1.src.rpm srpm=libjxl0.11-0.11.2-alt2.src.rpm ...
Girar sisyphus_riscv64 awaiter recycler
noreply at basealt.ru
Sat Jul 4 15:16:34 MSK 2026
http://web.build.srt.basealt.ru/tasks/131326/logs/events.1.1.log
subtask name riscv64
#100 libjxl 8:59
#200 libjxl0.11 8:06
#300 glycin 1:17:31
#400 glycin-2 57:53
#500 efl 25:27
#600 libwebkitgtk6.0 failed
2026-Jul-04 09:07:41 :: shared task #131326 for sisyphus_riscv64 started by recycler:
2026-Jul-04 09:07:41 :: message: sync
#100 build libjxl-0.12.0-alt1.src.rpm
#200 build libjxl0.11-0.11.2-alt2.src.rpm
#300 build glycin-1.2.3-alt1.src.rpm
#400 build glycin-2-2.1.5-alt1.src.rpm
#500 build efl-1.28.1-alt1.1.src.rpm
#600 build libwebkitgtk6.0-2.52.4-alt1.src.rpm
#700 build darktable-5.6.0-alt1.src.rpm
#1000 build rawtherapee-5.12-alt1.1.src.rpm
#1100 build gthumb-3.12.10-alt1.src.rpm
#1200 build fotocx-26.6-alt1.src.rpm
#1300 build geeqie-2.9-alt1.src.rpm
2026-Jul-04 09:07:42 :: created build repo
2026-Jul-04 09:07:52 :: [riscv64] #100 libjxl-0.12.0-alt1.src.rpm: build start
2026-Jul-04 09:16:51 :: [riscv64] #100 libjxl-0.12.0-alt1.src.rpm: build OK
2026-Jul-04 09:16:51 :: [riscv64] #200 libjxl0.11-0.11.2-alt2.src.rpm: build start
2026-Jul-04 09:24:57 :: [riscv64] #200 libjxl0.11-0.11.2-alt2.src.rpm: build OK
2026-Jul-04 09:24:57 :: [riscv64] #300 glycin-1.2.3-alt1.src.rpm: build start
2026-Jul-04 10:42:28 :: [riscv64] #300 glycin-1.2.3-alt1.src.rpm: build OK
2026-Jul-04 10:42:28 :: [riscv64] #400 glycin-2-2.1.5-alt1.src.rpm: build start
2026-Jul-04 11:40:21 :: [riscv64] #400 glycin-2-2.1.5-alt1.src.rpm: build OK
2026-Jul-04 11:40:21 :: [riscv64] #500 efl-1.28.1-alt1.1.src.rpm: build start
2026-Jul-04 12:05:48 :: [riscv64] #500 efl-1.28.1-alt1.1.src.rpm: build OK
2026-Jul-04 12:05:48 :: [riscv64] #600 libwebkitgtk6.0-2.52.4-alt1.src.rpm: build start
[riscv64] 4374 | static SType S() { return SType::v<SType, value>(); }
[riscv64] /usr/src/RPM/BUILD/webkitgtk-2.52.4/Source/JavaScriptCore/assembler/MacroAssemblerRISCV64.h:1110:58: error: no matching function for call to 'S'
[riscv64] 1110 | m_assembler.sbInsn(resolution.base, immRegister, Imm::S(resolution.offset));
[riscv64] --
[riscv64] 4374 | static SType S() { return SType::v<SType, value>(); }
[riscv64] /usr/src/RPM/BUILD/webkitgtk-2.52.4/Source/JavaScriptCore/assembler/MacroAssemblerRISCV64.h:1130:50: error: no matching function for call to 'S'
[riscv64] 1130 | m_assembler.shInsn(resolution.base, src, Imm::S(resolution.offset));
[riscv64] --
[riscv64] 4374 | static SType S() { return SType::v<SType, value>(); }
[riscv64] /usr/src/RPM/BUILD/webkitgtk-2.52.4/Source/JavaScriptCore/assembler/MacroAssemblerRISCV64.h:1136:50: error: no matching function for call to 'S'
[riscv64] 1136 | m_assembler.shInsn(resolution.base, src, Imm::S(resolution.offset));
[riscv64] --
[riscv64] 4374 | static SType S() { return SType::v<SType, value>(); }
[riscv64] /usr/src/RPM/BUILD/webkitgtk-2.52.4/Source/JavaScriptCore/assembler/MacroAssemblerRISCV64.h:1157:58: error: no matching function for call to 'S'
[riscv64] 1157 | m_assembler.shInsn(resolution.base, immRegister, Imm::S(resolution.offset));
[riscv64] --
[riscv64] 4374 | static SType S() { return SType::v<SType, value>(); }
[riscv64] /usr/src/RPM/BUILD/webkitgtk-2.52.4/Source/JavaScriptCore/assembler/MacroAssemblerRISCV64.h:1171:58: error: no matching function for call to 'S'
[riscv64] 1171 | m_assembler.shInsn(resolution.base, immRegister, Imm::S(resolution.offset));
[riscv64] --
[riscv64] 4374 | static SType S() { return SType::v<SType, value>(); }
[riscv64] /usr/src/RPM/BUILD/webkitgtk-2.52.4/Source/JavaScriptCore/assembler/MacroAssemblerRISCV64.h:1191:50: error: no matching function for call to 'S'
[riscv64] 1191 | m_assembler.swInsn(resolution.base, src, Imm::S(resolution.offset));
[riscv64] --
[riscv64] 4374 | static SType S() { return SType::v<SType, value>(); }
[riscv64] /usr/src/RPM/BUILD/webkitgtk-2.52.4/Source/JavaScriptCore/assembler/MacroAssemblerRISCV64.h:1197:50: error: no matching function for call to 'S'
[riscv64] 1197 | m_assembler.swInsn(resolution.base, src, Imm::S(resolution.offset));
[riscv64] --
[riscv64] 4374 | static SType S() { return SType::v<SType, value>(); }
[riscv64] fatal error: too many errors emitted, stopping now [-ferror-limit=]
[riscv64] 20 errors generated.
2026-Jul-04 12:16:33 :: [riscv64] libwebkitgtk6.0-2.52.4-alt1.src.rpm: remote: build failed
2026-Jul-04 12:16:33 :: [riscv64] #600 libwebkitgtk6.0-2.52.4-alt1.src.rpm: build FAILED
2026-Jul-04 12:16:33 :: [riscv64] requesting cancellation of task processing
2026-Jul-04 12:16:34 :: [riscv64] build FAILED
2026-Jul-04 12:16:34 :: task #131326 for sisyphus_riscv64 FAILED
More information about the Riscv-reports
mailing list