[riscv-reports] [#131126] sisyphus_riscv64 FAILED (try 4) llvm.git=22.1.8-alt0.port srpm=rust-1.96.0-alt1.src.rpm ...
Girar sisyphus_riscv64 awaiter iv
noreply at basealt.ru
Mon Jul 6 16:49:53 MSK 2026
http://web.build.srt.basealt.ru/tasks/131126/logs/events.4.1.log
subtask name riscv64
#500 firefox failed
2026-Jul-06 11:08:07 :: task #131126 for sisyphus_riscv64 resumed by iv:
2026-Jul-06 11:08:07 :: message: sync
#100 build 22.1.8-alt0.port from /people/iv/packages/llvm.git fetched at 2026-Jul-01 11:48:02
#200 build rust-1.96.0-alt1.src.rpm from sisyphus_riscv64
#300 build fd-10.4.2-alt1.src.rpm from sisyphus_riscv64
#400 build librsvg-2.62.3-alt1.src.rpm from sisyphus_riscv64
#500 build 152.0.4-alt0.port from /people/iv/packages/firefox.git fetched at 2026-Jul-06 11:05:29
2026-Jul-06 11:08:08 :: created build repo
2026-Jul-06 11:08:10 :: [riscv64] #100 llvm.git 22.1.8-alt0.port: build start
2026-Jul-06 11:08:46 :: [riscv64] #100 llvm.git 22.1.8-alt0.port: build swiftly SKIPPED
2026-Jul-06 11:08:46 :: [riscv64] #200 rust-1.96.0-alt1.src.rpm: build start
2026-Jul-06 11:08:58 :: [riscv64] #200 rust-1.96.0-alt1.src.rpm: build swiftly SKIPPED
2026-Jul-06 11:08:58 :: [riscv64] #300 fd-10.4.2-alt1.src.rpm: build start
2026-Jul-06 11:09:01 :: [riscv64] #300 fd-10.4.2-alt1.src.rpm: build swiftly SKIPPED
2026-Jul-06 11:09:01 :: [riscv64] #400 librsvg-2.62.3-alt1.src.rpm: build start
2026-Jul-06 11:09:06 :: [riscv64] #400 librsvg-2.62.3-alt1.src.rpm: build swiftly SKIPPED
2026-Jul-06 11:09:06 :: [riscv64] #500 firefox.git 152.0.4-alt0.port: build start
[riscv64] 55:05.07 W In file included from /usr/src/RPM/BUILD/firefox-152.0.4/js/src/jit/riscv64/constant/Base-constant-riscv.cpp:16:
[riscv64] 55:05.07 E /usr/src/RPM/BUILD/firefox-152.0.4/js/src/jit/riscv64/Simulator-riscv64.h:32:4: error: "simulator disabled"
[riscv64] 55:05.07 E 32 | # error "simulator disabled"
[riscv64] --
[riscv64] 87:53.37 Compiling gkrust v0.1.0 (/usr/src/RPM/BUILD/firefox-152.0.4/toolkit/library/rust)
[riscv64] 140:57.27 E error: could not compile `gkrust` (lib)
[riscv64] 140:57.27 E Caused by:
2026-Jul-06 13:49:51 :: [riscv64] firefox.git 152.0.4-alt0.port: remote: build failed
2026-Jul-06 13:49:51 :: [riscv64] #500 firefox.git 152.0.4-alt0.port: build FAILED
2026-Jul-06 13:49:52 :: [riscv64] requesting cancellation of task processing
2026-Jul-06 13:49:53 :: [riscv64] build FAILED
2026-Jul-06 13:49:53 :: task #131126 for sisyphus_riscv64 FAILED
More information about the Riscv-reports
mailing list