[riscv-reports] [#131126] [test-only] sisyphus_riscv64 FAILED (try 3) llvm.git=22.1.8-alt0.port srpm=rust-1.96.0-alt1.src.rpm ...
Girar sisyphus_riscv64 awaiter iv
noreply at basealt.ru
Fri Jul 3 11:46:46 MSK 2026
http://web.build.srt.basealt.ru/tasks/131126/logs/events.3.1.log
subtask name riscv64
#300 fd 15:40
#400 librsvg 37:48
2026-Jul-03 07:48:09 :: test-only task #131126 for sisyphus_riscv64 resumed by iv:
2026-Jul-03 07:48:09 :: message: sync
#100 build 22.1.8-alt0.port from /people/iv/packages/llvm.git fetched at 2026-Jul-01 11:48:02
#200 build rust-1.96.0-alt1.src.rpm from sisyphus_riscv64
#300 build fd-10.4.2-alt1.src.rpm from sisyphus_riscv64
#400 build librsvg-2.62.3-alt1.src.rpm from sisyphus_riscv64
2026-Jul-03 07:48:09 :: created build repo
2026-Jul-03 07:48:15 :: [riscv64] #100 llvm.git 22.1.8-alt0.port: build start
2026-Jul-03 07:48:56 :: [riscv64] #100 llvm.git 22.1.8-alt0.port: build swiftly SKIPPED
2026-Jul-03 07:48:56 :: [riscv64] #200 rust-1.96.0-alt1.src.rpm: build start
2026-Jul-03 07:49:10 :: [riscv64] #200 rust-1.96.0-alt1.src.rpm: build swiftly SKIPPED
2026-Jul-03 07:49:10 :: [riscv64] #300 fd-10.4.2-alt1.src.rpm: build start
2026-Jul-03 08:04:50 :: [riscv64] #300 fd-10.4.2-alt1.src.rpm: build OK
2026-Jul-03 08:04:50 :: [riscv64] #400 librsvg-2.62.3-alt1.src.rpm: build start
2026-Jul-03 08:42:38 :: [riscv64] #400 librsvg-2.62.3-alt1.src.rpm: build OK
2026-Jul-03 08:42:38 :: 100: build check OK (cached)
riscv64/rpms/rust-cargo-1.96.0-alt1.riscv64.rpm: exception not found in '/usr/share/license-exception' directory: linking
riscv64/rpms/rust-cargo-1.96.0-alt1.riscv64.rpm: license not found in '/usr/share/license' directory: exception
2026-Jul-03 08:42:38 :: 200: build check OK (cached)
2026-Jul-03 08:42:39 :: 300: build check OK
2026-Jul-03 08:42:41 :: 400: build check OK
2026-Jul-03 08:42:41 :: build check OK
2026-Jul-03 08:42:43 :: #100: llvm.git 22.1.8-alt0.port: version check OK
2026-Jul-03 08:42:43 :: #200: rust-1.96.0-alt1.src.rpm: version check OK
2026-Jul-03 08:42:43 :: #300: fd-10.4.2-alt1.src.rpm: version check OK
2026-Jul-03 08:42:44 :: #400: librsvg-2.62.3-alt1.src.rpm: version check OK
2026-Jul-03 08:42:44 :: build version check OK
2026-Jul-03 08:42:45 :: noarch check OK
2026-Jul-03 08:42:45 :: plan: src +4 -4 =21201, noarch +10 -10 =21991, riscv64 +71 -71 =37531
#100 llvm22.1 22.1.5-alt0.port -> 22.1.8-alt0.port
Wed Jul 01 2026 Ivan A. Melnikov <iv at altlinux.org> 22.1.8-alt0.port
- Fix building w/o lldb.
- Modernize loongarch64 and riscv64 build options:
+ enable lldb (at least it's buildable now)
+ build with clang
+ compress debuginfo to reduce the size of static libraries (fixes
building on riscv64 by making devel subpackage fit into RPM's 4Gb
payolad limit).
Tue Jun 30 2026 L.A. Kostis <lakostis at altlinux.ru> 22.1.8-alt0.1
- 22.1.8.
[...]
2026-Jul-03 08:43:17 :: patched apt indices
2026-Jul-03 08:43:20 :: created next repo
2026-Jul-03 08:43:30 :: duplicate provides check OK
2026-Jul-03 08:43:54 :: dependencies check OK
2026-Jul-03 08:44:18 :: [riscv64] ELF symbols check OK
2026-Jul-03 08:44:40 :: [riscv64.0] #100 clang22.1: install check start
2026-Jul-03 08:44:40 :: [riscv64.0] #100 clang22.1: install check swiftly skipped
2026-Jul-03 08:44:40 :: [riscv64.0] #100 clang22.1-analyzer: install check start
2026-Jul-03 08:44:40 :: [riscv64.0] #100 clang22.1-analyzer: install check swiftly skipped
2026-Jul-03 08:44:40 :: [riscv64.0] #100 clang22.1-devel: install check start
2026-Jul-03 08:44:40 :: [riscv64.0] #100 clang22.1-devel: install check swiftly skipped
2026-Jul-03 08:44:40 :: [riscv64.0] #100 clang22.1-doc: install check start
2026-Jul-03 08:44:40 :: [riscv64.0] #100 clang22.1-doc: install check swiftly skipped
2026-Jul-03 08:44:40 :: [riscv64.0] #100 clang22.1-libs: install check start
2026-Jul-03 08:44:40 :: [riscv64.0] #100 clang22.1-libs: install check swiftly skipped
2026-Jul-03 08:44:40 :: [riscv64.0] #100 clang22.1-support: install check start
2026-Jul-03 08:44:40 :: [riscv64.0] #100 clang22.1-support: install check swiftly skipped
2026-Jul-03 08:44:40 :: [riscv64.0] #100 clang22.1-support-shared-runtimes: install check start
2026-Jul-03 08:44:40 :: [riscv64.0] #100 clang22.1-support-shared-runtimes: install check swiftly skipped
2026-Jul-03 08:44:40 :: [riscv64.1] #100 clang22.1-tools: install check start
2026-Jul-03 08:44:40 :: [riscv64.1] #100 clang22.1-tools: install check swiftly skipped
2026-Jul-03 08:44:40 :: [riscv64.0] #100 clangd22.1: install check start
2026-Jul-03 08:44:40 :: [riscv64.0] #100 clangd22.1: install check swiftly skipped
2026-Jul-03 08:44:40 :: [riscv64.1] #200 clippy: install check start
2026-Jul-03 08:44:40 :: [riscv64.1] #200 clippy: install check swiftly skipped
2026-Jul-03 08:44:40 :: [riscv64.0] #300 fd: install check start
2026-Jul-03 08:44:41 :: [riscv64.1] #100 libclang-cpp22: install check start
2026-Jul-03 08:44:41 :: [riscv64.1] #100 libclang-cpp22: install check swiftly skipped
2026-Jul-03 08:44:41 :: [riscv64.1] #100 libclang22: install check start
2026-Jul-03 08:44:41 :: [riscv64.1] #100 libclang22: install check swiftly skipped
2026-Jul-03 08:44:41 :: [riscv64.1] #100 liblldb22.1: install check start
2026-Jul-03 08:44:41 :: [riscv64.1] #100 liblldb22.1: install check swiftly skipped
2026-Jul-03 08:44:41 :: [riscv64.1] #100 liblldb22.1-devel: install check start
2026-Jul-03 08:44:41 :: [riscv64.1] #100 liblldb22.1-devel: install check swiftly skipped
2026-Jul-03 08:44:41 :: [riscv64.1] #100 libmlir22.1: install check start
2026-Jul-03 08:44:41 :: [riscv64.1] #100 libmlir22.1: install check swiftly skipped
2026-Jul-03 08:44:41 :: [riscv64.2] #100 libmlir22.1-devel: install check start
2026-Jul-03 08:44:41 :: [riscv64.1] #100 libomp22.1-devel: install check start
2026-Jul-03 08:44:41 :: [riscv64.2] #100 libmlir22.1-devel: install check swiftly skipped
2026-Jul-03 08:44:41 :: [riscv64.1] #100 libomp22.1-devel: install check swiftly skipped
2026-Jul-03 08:44:41 :: [riscv64.2] #100 libomp5: install check start
2026-Jul-03 08:44:41 :: [riscv64.2] #100 libomp5: install check swiftly skipped
2026-Jul-03 08:44:41 :: [riscv64.1] #100 libomptarget22.1: install check start
2026-Jul-03 08:44:41 :: [riscv64.1] #100 libomptarget22.1: install check swiftly skipped
2026-Jul-03 08:44:41 :: [riscv64.2] #100 libpolly22.1-devel: install check start
2026-Jul-03 08:44:41 :: [riscv64.2] #100 libpolly22.1-devel: install check swiftly skipped
2026-Jul-03 08:44:41 :: [riscv64.1] #100 libpolly22.1-doc: install check start
2026-Jul-03 08:44:41 :: [riscv64.1] #100 libpolly22.1-doc: install check swiftly skipped
2026-Jul-03 08:44:41 :: [riscv64.2] #400 librsvg: install check start
2026-Jul-03 08:44:41 :: [riscv64.1] #400 librsvg-devel: install check start
2026-Jul-03 08:44:41 :: [riscv64.3] #400 librsvg-devel-doc: install check start
2026-Jul-03 08:44:41 :: [riscv64.4] #400 librsvg-gir: install check start
2026-Jul-03 08:44:41 :: [riscv64.5] #400 librsvg-gir-devel: install check start
2026-Jul-03 08:44:41 :: [riscv64.6] #400 librsvg-utils: install check start
2026-Jul-03 08:44:41 :: [riscv64.7] #100 lld22.1: install check start
2026-Jul-03 08:44:41 :: [riscv64.7] #100 lld22.1: install check swiftly skipped
2026-Jul-03 08:44:41 :: [riscv64.7] #100 lld22.1-devel: install check start
2026-Jul-03 08:44:41 :: [riscv64.7] #100 lld22.1-devel: install check swiftly skipped
2026-Jul-03 08:44:41 :: [riscv64.7] #100 lld22.1-doc: install check start
2026-Jul-03 08:44:41 :: [riscv64.7] #100 lld22.1-doc: install check swiftly skipped
2026-Jul-03 08:44:41 :: [riscv64.7] #100 lldb22.1: install check start
2026-Jul-03 08:44:41 :: [riscv64.7] #100 lldb22.1: install check swiftly skipped
2026-Jul-03 08:44:41 :: [riscv64.7] #100 lldb22.1-doc: install check start
2026-Jul-03 08:44:41 :: [riscv64.7] #100 lldb22.1-doc: install check swiftly skipped
2026-Jul-03 08:44:41 :: [riscv64.7] #100 llvm22.1: install check start
2026-Jul-03 08:44:41 :: [riscv64.7] #100 llvm22.1: install check swiftly skipped
2026-Jul-03 08:44:41 :: [riscv64.7] #100 llvm22.1-bolt: install check start
2026-Jul-03 08:44:41 :: [riscv64.7] #100 llvm22.1-bolt: install check swiftly skipped
2026-Jul-03 08:44:41 :: [riscv64.7] #100 llvm22.1-bolt-doc: install check start
2026-Jul-03 08:44:41 :: [riscv64.7] #100 llvm22.1-bolt-doc: install check swiftly skipped
2026-Jul-03 08:44:41 :: [riscv64.7] #100 llvm22.1-cmake-common-modules: install check start
2026-Jul-03 08:44:41 :: [riscv64.7] #100 llvm22.1-cmake-common-modules: install check swiftly skipped
2026-Jul-03 08:44:41 :: [riscv64.7] #100 llvm22.1-devel: install check start
2026-Jul-03 08:44:41 :: [riscv64.7] #100 llvm22.1-devel: install check swiftly skipped
2026-Jul-03 08:44:41 :: [riscv64.7] #100 llvm22.1-doc: install check start
2026-Jul-03 08:44:41 :: [riscv64.7] #100 llvm22.1-doc: install check swiftly skipped
2026-Jul-03 08:44:41 :: [riscv64.7] #100 llvm22.1-filesystem: install check start
2026-Jul-03 08:44:41 :: [riscv64.7] #100 llvm22.1-filesystem: install check swiftly skipped
2026-Jul-03 08:44:41 :: [riscv64.7] #100 llvm22.1-gold: install check start
2026-Jul-03 08:44:41 :: [riscv64.7] #100 llvm22.1-gold: install check swiftly skipped
2026-Jul-03 08:44:42 :: [riscv64.7] #100 llvm22.1-libs: install check start
2026-Jul-03 08:44:42 :: [riscv64.7] #100 llvm22.1-libs: install check swiftly skipped
2026-Jul-03 08:44:42 :: [riscv64.7] #100 llvm22.1-polly: install check start
2026-Jul-03 08:44:42 :: [riscv64.7] #100 llvm22.1-polly: install check swiftly skipped
2026-Jul-03 08:44:42 :: [riscv64.7] #100 llvm22.1-tools: install check start
2026-Jul-03 08:44:42 :: [riscv64.7] #100 llvm22.1-tools: install check swiftly skipped
2026-Jul-03 08:44:42 :: [riscv64.7] #100 mlir22.1-tools: install check start
2026-Jul-03 08:44:42 :: [riscv64.7] #100 mlir22.1-tools: install check swiftly skipped
2026-Jul-03 08:44:42 :: [riscv64.7] #100 python3-module-lldb22.1: install check start
2026-Jul-03 08:44:42 :: [riscv64.7] #100 python3-module-lldb22.1: install check swiftly skipped
2026-Jul-03 08:44:42 :: [riscv64.7] #200 rust: install check start
2026-Jul-03 08:44:42 :: [riscv64.7] #200 rust: install check swiftly skipped
2026-Jul-03 08:44:42 :: [riscv64.7] #200 rust-analyzer: install check start
2026-Jul-03 08:44:42 :: [riscv64.7] #200 rust-analyzer: install check swiftly skipped
2026-Jul-03 08:44:42 :: [riscv64.7] #200 rust-cargo: install check start
2026-Jul-03 08:44:42 :: [riscv64.7] #200 rust-cargo: install check swiftly skipped
2026-Jul-03 08:44:42 :: [riscv64.7] #200 rust-doc: install check start
2026-Jul-03 08:44:42 :: [riscv64.7] #200 rust-doc: install check swiftly skipped
2026-Jul-03 08:44:42 :: [riscv64.7] #200 rust-full: install check start
2026-Jul-03 08:44:42 :: [riscv64.7] #200 rust-full: install check swiftly skipped
2026-Jul-03 08:44:42 :: [riscv64.7] #200 rust-gdb: install check start
2026-Jul-03 08:44:42 :: [riscv64.7] #200 rust-gdb: install check swiftly skipped
2026-Jul-03 08:44:42 :: [riscv64.7] #200 rust-riscv64gc-unknown-linux-gnu-target: install check start
2026-Jul-03 08:44:42 :: [riscv64.7] #200 rust-riscv64gc-unknown-linux-gnu-target: install check swiftly skipped
2026-Jul-03 08:44:42 :: [riscv64.7] #200 rust-src: install check start
2026-Jul-03 08:44:42 :: [riscv64.7] #200 rust-src: install check swiftly skipped
2026-Jul-03 08:44:42 :: [riscv64.7] #200 rust-toolchain: install check start
2026-Jul-03 08:44:42 :: [riscv64.7] #200 rust-toolchain: install check swiftly skipped
2026-Jul-03 08:44:42 :: [riscv64.7] #200 rust-wasm32-unknown-unknown-target: install check start
2026-Jul-03 08:44:42 :: [riscv64.7] #200 rust-wasm32-unknown-unknown-target: install check swiftly skipped
2026-Jul-03 08:44:42 :: [riscv64.7] #200 rustc: install check start
2026-Jul-03 08:44:42 :: [riscv64.7] #200 rustc: install check swiftly skipped
2026-Jul-03 08:44:42 :: [riscv64.7] #200 rustfmt: install check start
2026-Jul-03 08:44:42 :: [riscv64.7] #200 rustfmt: install check swiftly skipped
riscv64: fd=10.4.2-alt1 post-install unowned files:
/usr/share/fish
/usr/share/fish/vendor_completions.d
/usr/share/zsh
/usr/share/zsh/site-functions
2026-Jul-03 08:45:50 :: [riscv64.0] #300 fd: install check OK
2026-Jul-03 08:45:51 :: [riscv64.3] #400 librsvg-devel-doc: install check OK
2026-Jul-03 08:45:58 :: [riscv64.2] #400 librsvg: install check OK
2026-Jul-03 08:45:59 :: [riscv64.4] #400 librsvg-gir: install check OK
2026-Jul-03 08:46:02 :: [riscv64.6] #400 librsvg-utils: install check OK
2026-Jul-03 08:46:29 :: [riscv64.1] #400 librsvg-devel: install check OK
2026-Jul-03 08:46:42 :: [riscv64.5] #400 librsvg-gir-devel: install check OK
error: #100: llvm.git tag `22.1.8-alt0.port' is not inherited from /gears/l/llvm22.1.git branch `sisyphus_riscv64'
2026-Jul-03 08:46:45 :: gears inheritance check FAILED for: #100
2026-Jul-03 08:46:45 :: task #131126 for sisyphus_riscv64 FAILED
More information about the Riscv-reports
mailing list