[riscv-reports] [#131547] sisyphus_riscv64 FAILED srpm=serial-studio-4.0.2-alt1.src.rpm

Girar sisyphus_riscv64 awaiter recycler noreply at basealt.ru
Sun Jul 5 23:08:39 MSK 2026


http://web.build.srt.basealt.ru/tasks/131547/logs/events.1.1.log

2026-Jul-05 20:07:19 :: shared task #131547 for sisyphus_riscv64 started by recycler:
2026-Jul-05 20:07:19 :: message: sync
#100 build serial-studio-4.0.2-alt1.src.rpm
2026-Jul-05 20:07:26 :: [riscv64] #100 serial-studio-4.0.2-alt1.src.rpm: build start
2026-Jul-05 20:08:38 :: [riscv64] #100 serial-studio-4.0.2-alt1.src.rpm: build SKIPPED
2026-Jul-05 20:08:39 :: #100: serial-studio-4.0.2-alt1.src.rpm: no source package
2026-Jul-05 20:08:39 :: build check FAILED for: #100 
2026-Jul-05 20:08:39 :: task #131547 for sisyphus_riscv64 FAILED


More information about the Riscv-reports mailing list