[riscv-reports] [#131546] sisyphus_riscv64 FAILED srpm=kdevelop-php-26.04.3-alt1.src.rpm ...

Girar sisyphus_riscv64 awaiter recycler noreply at basealt.ru
Sun Jul 5 23:07:17 MSK 2026


http://web.build.srt.basealt.ru/tasks/131546/logs/events.1.1.log

2026-Jul-05 20:03:20 :: shared task #131546 for sisyphus_riscv64 started by recycler:
2026-Jul-05 20:03:20 :: message: sync
#100 build kdevelop-php-26.04.3-alt1.src.rpm
#200 build kdevelop-python-26.04.3-alt1.src.rpm
2026-Jul-05 20:03:20 :: created build repo
2026-Jul-05 20:03:28 :: [riscv64] #100 kdevelop-php-26.04.3-alt1.src.rpm: build start
2026-Jul-05 20:05:38 :: [riscv64] #100 kdevelop-php-26.04.3-alt1.src.rpm: build SKIPPED
2026-Jul-05 20:05:38 :: [riscv64] #200 kdevelop-python-26.04.3-alt1.src.rpm: build start
2026-Jul-05 20:07:16 :: [riscv64] #200 kdevelop-python-26.04.3-alt1.src.rpm: build SKIPPED
2026-Jul-05 20:07:16 :: #100: kdevelop-php-26.04.3-alt1.src.rpm: no source package
2026-Jul-05 20:07:17 :: #200: kdevelop-python-26.04.3-alt1.src.rpm: no source package
2026-Jul-05 20:07:17 :: build check FAILED for: #100 #200 
2026-Jul-05 20:07:17 :: task #131546 for sisyphus_riscv64 FAILED


More information about the Riscv-reports mailing list