[riscv-reports] [#137976] [test-only] sisyphus_riscv64 FAILED (try 6) sisyphus_check.git=0.8.71-alt1.0.port ...
Girar sisyphus_riscv64 awaiter iv
noreply at basealt.ru
Mon Aug 24 12:39:40 MSK 2026
http://web.build.srt.basealt.ru/tasks/137976/logs/events.6.1.log
2026-Aug-24 09:38:38 :: test-only task #137976 for sisyphus_riscv64 resumed by iv:
2026-Aug-24 09:38:38 :: message: kernel-modules-main
#100 build 0.8.71-alt1.0.port from /people/iv/packages/sisyphus_check.git fetched at 2026-Aug-21 10:26:33
#200 build 0.0.2-alt0.port from /people/iv/packages/rpm-build-kmodules-discard-locals.git fetched at 2026-Aug-21 11:10:46
#300 build 0.0.2-alt0.port from /people/iv/packages/rpm-build-debug-discard-locals.git fetched at 2026-Aug-21 11:11:21
#340 removed
#360 build 6.18-6.18.45-alt2.port.rv64 from /people/iv/packages/kernel-image.git fetched at 2026-Aug-21 19:01:14
#400 removed
#500 build sisyphus/kernel-modules-aic8800-sdio-6.18-5.0-alt1.22a6531 from /gears/k/kernel-modules-aic8800-sdio-6.18.git fetched at 2026-Aug-21 11:16:46 from sisyphus_riscv64
2026-Aug-24 09:38:38 :: created build repo
2026-Aug-24 09:38:51 :: [riscv64] #100 sisyphus_check.git 0.8.71-alt1.0.port: build start
2026-Aug-24 09:38:53 :: [riscv64] #100 sisyphus_check.git 0.8.71-alt1.0.port: build swiftly SKIPPED
2026-Aug-24 09:38:53 :: [riscv64] #200 rpm-build-kmodules-discard-locals.git 0.0.2-alt0.port: build start
2026-Aug-24 09:38:55 :: [riscv64] #200 rpm-build-kmodules-discard-locals.git 0.0.2-alt0.port: build swiftly SKIPPED
2026-Aug-24 09:38:56 :: [riscv64] #300 rpm-build-debug-discard-locals.git 0.0.2-alt0.port: build start
2026-Aug-24 09:38:58 :: [riscv64] #300 rpm-build-debug-discard-locals.git 0.0.2-alt0.port: build swiftly SKIPPED
2026-Aug-24 09:38:58 :: [riscv64] #360 kernel-image.git 6.18-6.18.45-alt2.port.rv64: build start
2026-Aug-24 09:39:36 :: [riscv64] #360 kernel-image.git 6.18-6.18.45-alt2.port.rv64: build swiftly SKIPPED
2026-Aug-24 09:39:36 :: [riscv64] #500 kernel-modules-aic8800-sdio-6.18.git sisyphus/kernel-modules-aic8800-sdio-6.18-5.0-alt1.22a6531: build start
2026-Aug-24 09:39:39 :: [riscv64] #500 kernel-modules-aic8800-sdio-6.18.git sisyphus/kernel-modules-aic8800-sdio-6.18-5.0-alt1.22a6531: build swiftly SKIPPED
2026-Aug-24 09:39:39 :: 100: build check OK (cached)
2026-Aug-24 09:39:39 :: 200: build check OK (cached)
2026-Aug-24 09:39:39 :: 300: build check OK (cached)
riscv64/srpm/kernel-image-6.18-6.18.45-alt2.port.rv64.src.rpm: changelog name iv at altlinux.org not found in signature
sisyphus_check: check-gpg ERROR: signature/changelog mismatch
2026-Aug-24 09:39:40 :: #360: kernel-image.git 6.18-6.18.45-alt2.port.rv64: sisyphus_check FAILED
2026-Aug-24 09:39:40 :: 500: build check OK (cached)
2026-Aug-24 09:39:40 :: build check FAILED for: #360
2026-Aug-24 09:39:40 :: task #137976 for sisyphus_riscv64 FAILED
More information about the Riscv-reports
mailing list