[riscv-reports] [#137976] [test-only] sisyphus_riscv64 FAILED (try 5) sisyphus_check.git=0.8.71-alt1.0.port ...
Girar sisyphus_riscv64 awaiter iv
noreply at basealt.ru
Sat Aug 22 00:08:11 MSK 2026
http://web.build.srt.basealt.ru/tasks/137976/logs/events.5.1.log
subtask name riscv64
#360 kernel-image 1:55:14
#500 kernel-modules-aic8800-sdio-6.18 3:56
2026-Aug-21 19:01:27 :: test-only task #137976 for sisyphus_riscv64 resumed by iv:
2026-Aug-21 19:01:27 :: message: kernel-modules-main
#100 build 0.8.71-alt1.0.port from /people/iv/packages/sisyphus_check.git fetched at 2026-Aug-21 10:26:33
#200 build 0.0.2-alt0.port from /people/iv/packages/rpm-build-kmodules-discard-locals.git fetched at 2026-Aug-21 11:10:46
#300 build 0.0.2-alt0.port from /people/iv/packages/rpm-build-debug-discard-locals.git fetched at 2026-Aug-21 11:11:21
#340 removed
#360 build 6.18-6.18.45-alt2.port.rv64 from /people/iv/packages/kernel-image.git fetched at 2026-Aug-21 19:01:14
#400 removed
#500 build sisyphus/kernel-modules-aic8800-sdio-6.18-5.0-alt1.22a6531 from /gears/k/kernel-modules-aic8800-sdio-6.18.git fetched at 2026-Aug-21 11:16:46 from sisyphus_riscv64
2026-Aug-21 19:01:27 :: created build repo
2026-Aug-21 19:01:35 :: [riscv64] #100 sisyphus_check.git 0.8.71-alt1.0.port: build start
2026-Aug-21 19:05:00 :: [riscv64] #100 sisyphus_check.git 0.8.71-alt1.0.port: build OK (cached)
2026-Aug-21 19:05:00 :: [riscv64] #200 rpm-build-kmodules-discard-locals.git 0.0.2-alt0.port: build start
2026-Aug-21 19:06:58 :: [riscv64] #200 rpm-build-kmodules-discard-locals.git 0.0.2-alt0.port: build OK (cached)
2026-Aug-21 19:06:58 :: [riscv64] #300 rpm-build-debug-discard-locals.git 0.0.2-alt0.port: build start
2026-Aug-21 19:08:36 :: [riscv64] #300 rpm-build-debug-discard-locals.git 0.0.2-alt0.port: build OK (cached)
2026-Aug-21 19:08:36 :: [riscv64] #360 kernel-image.git 6.18-6.18.45-alt2.port.rv64: build start
2026-Aug-21 21:03:50 :: [riscv64] #360 kernel-image.git 6.18-6.18.45-alt2.port.rv64: build OK
2026-Aug-21 21:03:50 :: [riscv64] #500 kernel-modules-aic8800-sdio-6.18.git sisyphus/kernel-modules-aic8800-sdio-6.18-5.0-alt1.22a6531: build start
2026-Aug-21 21:07:46 :: [riscv64] #500 kernel-modules-aic8800-sdio-6.18.git sisyphus/kernel-modules-aic8800-sdio-6.18-5.0-alt1.22a6531: build OK
2026-Aug-21 21:07:46 :: 100: build check OK (cached)
2026-Aug-21 21:07:47 :: 200: build check OK
2026-Aug-21 21:07:47 :: 300: build check OK
riscv64/rpms/kernel-image-6.18-6.18.45-alt2.port.rv64.riscv64.rpm: kernel image shouldn't require kernel modules
sisyphus_check: check-kernel ERROR: kernel package violation
2026-Aug-21 21:08:10 :: #360: kernel-image.git 6.18-6.18.45-alt2.port.rv64: sisyphus_check FAILED
2026-Aug-21 21:08:10 :: 500: build check OK
2026-Aug-21 21:08:11 :: build check FAILED for: #360
2026-Aug-21 21:08:11 :: task #137976 for sisyphus_riscv64 FAILED
More information about the Riscv-reports
mailing list