[Sisyphus-mipsel-reports] [#104835] sisyphus_mipsel FAILED srpm=python3-module-pikepdf-8.7.1-alt1.src.rpm ...
Girar awaiter robot
awaiter at gyle-secondary.office.basealt.ru
Fri Jan 19 17:48:50 MSK 2024
http://git.altlinux.org/tasks/104835/logs/events.1.1.log
2024-Jan-19 14:45:20 :: shared task #104835 for sisyphus_mipsel started by recycler:
#100 build python3-module-pikepdf-8.7.1-alt1.src.rpm
#200 build pdfarranger-1.10.1-alt1.src.rpm
2024-Jan-19 14:45:53 :: created build repo
2024-Jan-19 14:45:56 :: [mipsel] #100 python3-module-pikepdf-8.7.1-alt1.src.rpm: build start
distutils.ccompiler.CCompiler,
NameError: name 'distutils' is not defined
Traceback (most recent call last):
--
raise RuntimeError(err_msg) from None
RuntimeError: build_wheel failed
2024-Jan-19 14:48:50 :: [mipsel] python3-module-pikepdf-8.7.1-alt1.src.rpm: remote: build failed
2024-Jan-19 14:48:50 :: [mipsel] #100 python3-module-pikepdf-8.7.1-alt1.src.rpm: build FAILED
2024-Jan-19 14:48:50 :: [mipsel] requesting cancellation of task processing
2024-Jan-19 14:48:50 :: [mipsel] build FAILED
2024-Jan-19 14:48:50 :: task #104835 for sisyphus_mipsel FAILED
More information about the Sisyphus-mipsel-reports
mailing list