[Sisyphus-mipsel-reports] [#97861] sisyphus_mipsel FAILED srpm=glaxnimate-0.5.3-alt1.src.rpm

Girar awaiter robot awaiter at gyle-secondary.office.basealt.ru
Mon Jun 26 20:51:04 MSK 2023


2023-Jun-26 17:50:31 :: shared task #97861 for sisyphus_mipsel started by recycler:
#100 build glaxnimate-0.5.3-alt1.src.rpm
2023-Jun-26 17:50:35 :: [mipsel] #100 glaxnimate-0.5.3-alt1.src.rpm: build start
warning: Macro %cmake not found
warning: Macro %_cmake__builddir not found
warning: Macro %cmakeinstall_std not found
Reading Package Lists...
Building Dependency Tree...
glibc-devel is already the newest version.
E: Couldn't find package gcc12-c++
hsh-install: Failed to calculate package file list.
hsh-install: Failed to generate package file list.
2023-Jun-26 17:51:04 :: [mipsel] glaxnimate-0.5.3-alt1.src.rpm: remote: cannot build src.rpm
2023-Jun-26 17:51:04 :: [mipsel] #100 glaxnimate-0.5.3-alt1.src.rpm: build FAILED
2023-Jun-26 17:51:04 :: [mipsel] requesting cancellation of task processing
2023-Jun-26 17:51:04 :: [mipsel] build FAILED
2023-Jun-26 17:51:04 :: task #97861 for sisyphus_mipsel FAILED

More information about the Sisyphus-mipsel-reports mailing list