[Sisyphus-mipsel-reports] [#59266] sisyphus_mipsel FAILED srpm=python3-module-toml-0.10.2-alt2.src.rpm

Girar awaiter robot awaiter at gyle-secondary.office.basealt.ru
Mon Mar 29 14:52:48 MSK 2021


http://git.altlinux.org/tasks/59266/logs/events.1.1.log

2021-Mar-29 11:52:14 :: task #59266 for sisyphus_mipsel started by recycler:
#100 build python3-module-toml-0.10.2-alt2.src.rpm
2021-Mar-29 11:52:15 :: [mipsel] #100 python3-module-toml-0.10.2-alt2.src.rpm: build start
<13>Mar 29 11:52:41 rpmi: libgdbm-1.8.3-alt10 sisyphus_mipsel+27978.100.1.1 1557334065 installed
<13>Mar 29 11:52:41 rpmi: libexpat-2.2.10-alt1 sisyphus_mipsel+52329.100.1.1 1602890347 installed
<13>Mar 29 11:52:41 rpmi: libp11-kit-0.23.15-alt2 sisyphus_mipsel+46665.100.2.1 1591342786 installed
<13>Mar 29 11:52:41 rpmi: libtasn1-4.16.0-alt1 sisyphus_mipsel+41171.100.2.1 1581676510 installed
<13>Mar 29 11:52:41 rpmi: rpm-macros-alternatives-0.5.1-alt1 sisyphus_mipsel+25713.100.2.1 1554890888 installed
<13>Mar 29 11:52:41 rpmi: alternatives-0.5.1-alt1 sisyphus_mipsel+25713.100.2.1 1554890888 installed
<13>Mar 29 11:52:41 rpmi: ca-certificates-2020.06.29-alt1 sisyphus_mipsel+47950.300.1.1 1593513240 installed
<13>Mar 29 11:52:41 rpmi: ca-trust-0.1.2-alt1 sisyphus_mipsel+31443.100.2.1 1561717596 installed
<13>Mar 29 11:52:41 rpmi: p11-kit-trust-0.23.15-alt2 sisyphus_mipsel+46665.100.2.1 1591342786 installed
<13>Mar 29 11:52:42 rpmi: libcrypto1.1-1.1.1k-alt1 sisyphus_mipsel+59120.100.1.1 1616837987 installed
<13>Mar 29 11:52:42 rpmi: libssl1.1-1.1.1k-alt1 sisyphus_mipsel+59120.100.1.1 1616837987 installed
<13>Mar 29 11:52:42 rpmi: python3-3.9.2-alt1 sisyphus_mipsel+58762.500.2.1 1615914691 installed
<13>Mar 29 11:52:44 rpmi: python3-base-3.9.2-alt1 sisyphus_mipsel+58762.500.2.1 1615914691 installed
<13>Mar 29 11:52:44 rpmi: libpython3-3.9.2-alt1 sisyphus_mipsel+58762.500.2.1 1615914691 installed
<13>Mar 29 11:52:44 rpmi: tests-for-installed-python3-pkgs-0.1.13.1-alt2 1535451329 installed
<13>Mar 29 11:52:44 rpmi: rpm-build-python3-0.1.13.1-alt2 1535451329 installed
Reading Package Lists...
Building Dependency Tree...
MI2a: mark python3-module-numpy
MI2a:  target libblas.so.3gf
MI2a:   mark libblas3gf
MI2a:  target liblapack.so.4
MI2a:   mark liblapack
MI2a:    target libgfortran.so.5
MI2a:     mark libgfortran5
MI2a:    target libxblas.so.0
MI2a:     mark libxblas
MI2a:  target python3(pkg_resources)
MI2a:   mark python3-module-pkg_resources
MI2a: mark python3-module-tox
MI2a:  target python3(virtualenv)
MI2a:   mark python3-module-virtualenv
MI2a:  target python3(filelock)
MI2a:   mark python3-module-filelock
MI2a:  target python3(packaging)
MI2a:   mark python3-module-packaging
MI2a:    target python3(pyparsing)
MI2a:     mark python3-module-pyparsing
MI2a:    target python3(six.moves.urllib)
MI2a:     mark python3-module-six
MI2a:  target python3(pluggy)
MI2a:   mark python3-module-pluggy
MI2a:  target python3(py)
MI2a:   mark python3-module-py
MI2a:    target python3(apipkg)
MI2a:     mark python3-module-apipkg
MI2a:    target python3(iniconfig)
MI2a:     mark python3-module-iniconfig
MI2a:  target python3(pytest)
MI2a:   mark python3-module-pytest
MI2a:    target python3(wcwidth)
MI2a:     mark python3-module-wcwidth
MI2a:    target python3(attr)
MI2a:     mark python3-module-attrs
MI2a:    target python3(more_itertools)
MI2a:     mark python3-module-more-itertools
MI2a:  target python3(toml)
MI2a:   mark python3-module-toml
rpm-build-python3 is already the newest version.
Selecting python3-module-numpy for 'python3(numpy)'
Selecting python3-module-tox for 'python3(tox)'
E: Couldn't find package python3(tox_console_scripts)
hsh-install: Failed to calculate package file list.
hsh-install: Failed to generate package file list.
2021-Mar-29 11:52:48 :: [mipsel] python3-module-toml-0.10.2-alt2.src.rpm: remote: cannot build src.rpm
2021-Mar-29 11:52:48 :: [mipsel] #100 python3-module-toml-0.10.2-alt2.src.rpm: build FAILED
2021-Mar-29 11:52:48 :: [mipsel] requesting cancellation of task processing
2021-Mar-29 11:52:48 :: [mipsel] build FAILED
2021-Mar-29 11:52:48 :: task #59266 for sisyphus_mipsel FAILED


More information about the Sisyphus-mipsel-reports mailing list